program: Gaussian 09
title: 000277665
version: EM64L-G09RevD.01
frameworkgroup: C1[X(C10H12O3)]
method: RPBEPBE
basis: SDD
operation: Freq
keyword: #pfreq=noraman
keyword: PBEPBE/SDD
title: #p freq=noraman PBEPBE/SDD
converged: YES YES NO NO
title: Mulliken charges:
elementType: O O O C C C C C C C C C C H H H H H H H H H H H H
charge: -0.447388 -0.401896 -0.237193 0.495381 0.366616 -0.532103 -0.273362 -0.362193 -0.384767 -0.400313 -0.401472 -0.671687 0.164045 0.208849 0.210491 0.271121 0.253250 0.264319 0.231507 0.232399 0.223264 0.217056 0.221667 0.364482 0.387925
chargesum: 0.00000
title: Mulliken charges with hydrogens summed into heavy atoms:
elementType: O O O C C C C C C C C C C
charge: -0.082906 -0.013971 -0.237193 0.495381 0.366616 -0.112762 -0.002241 -0.108942 -0.120448 -0.168805 -0.169073 -0.009700 0.164045
polarizability: 1.52458693e+02 -7.52799191e-01 1.11992768e+02 -9.72033177e-01 1.23761678e+01 8.18436331e+01
1716.lowfreq: -16.5322 -8.1825 0.0007 0.0008 0.0009 2.4377 9.2155 26.3240 51.1507
frequency: -6.6653 26.2345 51.1434 75.9311 131.2934 182.0270 208.7037 227.9968 275.4956 330.3429 372.2500 376.5526 383.6540 409.0848 422.9258 527.2123 540.4599 589.4514 624.5537 636.3627 668.1217 718.6348 770.5264 784.0120 807.6827 851.7434 860.4595 875.5736 962.8056 968.8239 983.0782 1009.0139 1016.0742 1045.3995 1061.2703 1068.9586 1126.5255 1171.0854 1195.3708 1212.0770 1217.1624 1240.7749 1258.4537 1300.5145 1310.5859 1312.3586 1372.3080 1387.5944 1391.3798 1407.5478 1471.7710 1473.6211 1489.0640 1501.9174 1584.1386 1620.1642 1646.4264 2979.2931 2986.6800 3037.6630 3037.8337 3078.3474 3083.6651 3116.6308 3120.3139 3145.7416 3164.0659 3476.6438 3508.3360
redmass: 2.6262 4.0330 6.4921 6.0693 4.6242 2.8605 2.8855 1.6652 4.7202 3.7548 2.3242 1.4743 4.2601 2.5934 3.2827 2.9954 2.8008 2.0485 3.4242 6.4212 2.8234 3.4934 3.9167 1.1671 2.3260 1.5023 2.4027 2.5351 1.3614 2.3748 1.3635 4.5914 3.0224 1.5194 2.0564 2.1983 1.2911 2.1568 1.3090 1.3549 2.2273 1.2595 1.4151 1.7552 1.4927 1.3020 2.1986 1.2072 2.5447 2.5220 1.0432 1.0735 1.1024 2.4139 6.8829 6.3577 8.6797 1.0349 1.0597 1.1016 1.0846 1.1001 1.1012 1.0883 1.0895 1.0955 1.0938 1.0651 1.0641
irintensity: 0.3122 0.5713 0.7114 1.2490 1.9237 2.9197 0.3611 2.8561 6.1434 11.5341 28.1219 92.9313 2.2794 18.9941 13.4063 25.1951 16.1120 90.5507 38.8755 2.0629 94.7538 3.7304 3.1312 2.5674 36.6581 3.0697 12.7932 32.8807 1.7153 6.4352 1.4147 123.4344 58.9299 15.0073 25.1664 121.3871 5.4321 21.8571 4.4632 15.1092 0.4847 0.1549 26.6408 53.6067 2.4898 1.3743 13.7597 9.5802 13.3138 11.9666 14.5995 1.6233 6.9497 39.2548 0.3979 6.2988 220.0613 39.6238 37.3588 9.2802 8.7332 58.8418 39.9979 14.6752 18.2550 10.7414 4.0904 35.8014 28.5251
temp: 298.150 k
press: 1.00000 atm
elementType: 8 8 8 6 6 6 6 6 6 6 6 6 6 1 1 1 1 1 1 1 1 1 1 1 1
symmnumber: 1
zpe: 521990.0 jmol-1
zpe.correction: 0.198815 hartree
zpe.thermalcorrener: 0.210911 hartree
zpe.thermalcorrenthalpy: 0.211855 hartree
zpe.thermalcorrgfe: 0.159439 hartree
zpe.sumelectzpe: -612.966878 hartree
zpe.sumelectthermal: -612.954783 hartree
zpe.sumelectthermalent: -612.953839 hartree
zpe.sumelectthermalfe: -613.006254 hartree
dipole: 1.3400 -2.4494 0.2811
dipole: 2.8061
quadrupole: -72.3099 -71.1764 -80.9694
quadrupole: 7.8406 0.8199 3.0512
quadrupole: 2.5087 3.6422 -6.1509 7.8406 0.8199 3.0512
hfenergy: -613.1656934 hartree
pointgroup: C01 [X(C10H12O3)]
dipole: -0.5625128 0.5769054 -0.7546972 debye
dipolederiv: -0.7896201 0.0586402 -0.0775587 0.083625 -0.2632992 0.123097 -0.1745589 0.1021199 -0.5526777 -0.4313937 0.0424388 0.0738295 -0.0092174 -0.2893476 0.2232326 0.1120271 0.139406 -1.1489069 -0.5517051 -0.191271 -0.1813284 -0.4699154 -0.6528659 -0.187013 -0.1535274 -0.0057296 -0.7343673 0.3505417 -0.0991966 -0.0129797 -0.0970555 -0.0632879 0.0005252 -0.0210488 0.0022791 -0.0433483 0.1715414 0.1017208 -0.0554629 -0.1062226 -0.1619714 0.0485126 0.0062055 0.0491399 -0.1010679 0.0517267 0.05083 0.0054204 0.1892131 0.054234 -0.0125111 0.0141642 -0.0083659 0.1547671 0.3566174 -0.246041 0.1449746 -0.1569433 0.1266627 0.0265992 0.2979091 -0.0417566 0.4186004 -0.0859334 -0.0126496 -0.0499756 -0.0042406 -0.1342752 -0.0347672 -0.0292343 -0.0238628 0.041693 -0.1177868 -0.0502832 0.0467194 -0.0414749 -0.1117749 -0.0491968 -0.0204494 -0.0414817 0.0243785 -0.1459567 0.0067115 0.0554689 -0.0088976 -0.1524246 -0.0376808 0.1353936 -0.0342043 0.0617845 -0.1355766 0.0180401 -0.0630261 0.0314315 -0.1527535 -0.0242893 -0.1165578 -0.0132108 0.0820435 -0.0289732 0.0410728 0.0064648 -0.0655074 0.0037321 -0.0048382 -0.0058551 -0.0067948 0.0744338 0.5808518 0.3819015 0.1247519 0.7770556 0.8087762 -0.0030942 -0.0116228 -0.0699626 1.3956296 -0.0206447 -0.0160875 -0.0383534 -0.0281683 0.0164153 -0.0693046 -0.1125238 -0.1068893 -0.0876029 -0.0105647 -0.0180513 0.0327959 -0.0471533 -0.0205673 0.0844074 0.1058626 0.1195991 -0.0548054 -0.0166236 0.0358154 0.0065947 0.0458725 0.0359002 -0.0607726 0.0045689 -0.0534158 -0.0360956 0.0619909 0.0156406 0.0820442 -0.0006773 0.1416076 0.0198368 0.0850897 0.0168487 -0.0216473 0.1032439 0.0211772 -0.0701766 0.0043112 0.1418998 0.0298087 -0.0680149 0.0234237 0.00015 0.0033187 0.0116132 -0.1034111 0.0228122 0.1364029 0.0333282 -0.1013789 0.0319062 -0.0491346 0.0034939 -0.0151821 0.1032711 -0.0003558 0.1412405 0.0174875 0.1005007 0.0174078 -0.0560514 0.0770368 -0.0444723 -0.0968068 -0.0242263 0.0253598 -0.0491675 -0.0633669 -0.1018474 -0.0830397 -0.2538623 0.0740688 0.0115522 0.090135 0.0440688 -0.0078245 0.0122563 -0.0067097 0.1056976 0.0784843 -0.059674 0.0841492 -0.0369838 -0.0058664 0.0649118 0.0573357 0.1178971 -0.0557176 0.400815 0.0036533 -0.0051454 -0.0233803 0.1762344 -0.1381886 0.0169109 -0.067898 0.328748 0.3489782 -0.1104156 -0.0238121 -0.1240365 0.1558998 0.0069014 -0.0700852 -0.0378984 0.3365365 unknown
polarizability: 152.4753391|-0.3941548|78.5833932|-0.821512|-6.6564757|115.2363622 unknown
InChI: InChI=1S/C10H12O3/c1-2-7-3-5-8(6-4-7)9(11)10(12)13/h3-6,9,11-12H,2H2,1H3
charge 0 multiplicity 1
25 atoms
O  2.591646 -1.075964 1.265387
O  2.615371 0.85529 -1.821008
O  3.248028 1.4247 0.343442
C  -2.340057 -0.271426 0.068364
C  0.506282 -0.530684 0.002527
C  -3.850072 -0.083894 0.107627
C  2.040634 -0.688981 -0.02342
C  -0.222633 -0.317002 -1.193836
C  -0.192048 -0.627004 1.227131
C  -1.627081 -0.189668 -1.156366
C  -1.598341 -0.495613 1.25537
C  -4.25383 1.408523 0.252999
C  2.698731 0.630453 -0.454042
H  -4.30369 -0.490079 -0.816935
H  -4.278383 -0.656493 0.952323
H  2.320996 -1.475718 -0.745799
H  0.30716 -0.247435 -2.150698
H  0.37051 -0.833673 2.142558
H  -2.179577 -0.030462 -2.090935
H  -2.127983 -0.580004 2.212624
H  -3.845427 1.837896 1.18577
H  -5.353588 1.519594 0.274004
H  -3.862663 2.006218 -0.590271
H  2.908421 -0.248453 1.721779
H  3.013096 1.740081 -2.046796
