program: Gaussian 09
title: 000277660
version: EM64L-G09RevD.01
frameworkgroup: C1[X(C19H19N)]
method: RPBEPBE
basis: SDD
operation: Freq
keyword: #pfreq=noraman
keyword: PBEPBE/SDD
title: #p freq=noraman PBEPBE/SDD
converged: YES YES NO NO
title: Mulliken charges:
elementType: N C C C C C C C C C C C C C C C C C C C H H H H H H H H H H H H H H H H H H H
charge: -0.191086 0.065539 0.059879 0.185776 0.185505 0.297815 0.296907 -0.815267 -0.816756 -0.646477 -0.425172 -0.428789 -0.403826 -0.405077 -0.245305 -0.244090 -0.234555 -0.232824 -0.255511 -0.255208 0.227999 0.273439 0.226853 0.226780 0.225545 0.275260 0.241418 0.244402 0.237626 0.242762 0.244265 0.253330 0.253117 0.220486 0.220684 0.222772 0.222875 0.224385 0.224522
chargesum: 0.00000
title: Mulliken charges with hydrogens summed into heavy atoms:
elementType: N C C C C C C C C C C C C C C C C C C C
charge: -0.191086 0.065539 0.059879 0.185776 0.185505 0.297815 0.296907 -0.086976 -0.089172 0.076970 -0.182410 -0.184524 -0.150496 -0.151960 -0.024820 -0.023405 -0.011782 -0.009949 -0.031126 -0.030686
polarizability: 2.42393030e+02 1.93345704e+00 2.66148378e+02 -2.32545495e+01 2.30797790e+00 1.35587244e+02
1716.lowfreq: -8.2572 -4.1096 -0.0006 -0.0006 -0.0003 10.7843 45.6729 51.0428 51.7262
frequency: 45.6720 50.9425 51.7122 57.6708 79.5988 80.9988 105.5051 136.6292 164.9477 182.1668 208.9469 213.4114 243.0084 252.4737 274.2710 307.3970 317.9471 343.7436 385.6555 400.6464 409.2081 411.2911 504.5856 507.1283 568.6558 613.3677 614.4374 619.0098 636.9959 645.9046 651.2718 703.2461 705.9855 707.6588 761.9920 771.1297 789.9102 831.0545 854.1922 856.0941 919.4461 921.0770 971.8809 975.1384 977.9074 982.2031 988.4518 988.6303 991.5567 992.7246 1020.2989 1028.9762 1035.6380 1041.8518 1044.8240 1075.7654 1081.2802 1112.7291 1132.8132 1136.7616 1169.7429 1170.0262 1187.0940 1189.6287 1192.2512 1285.0214 1309.2439 1314.2410 1367.7440 1368.1198 1381.1263 1396.5410 1401.0198 1403.2653 1415.4340 1430.3642 1436.9788 1447.5602 1464.3553 1469.5595 1473.4619 1476.5257 1480.3695 1483.8982 1489.2607 1495.3952 1554.5162 1566.6924 1578.8829 1586.7035 1612.4899 1615.0887 2956.2550 2957.7956 2976.5448 3021.3634 3024.0032 3067.3032 3094.6647 3097.7602 3110.3198 3116.6050 3116.8813 3124.8086 3125.2046 3138.2803 3138.4147 3148.3409 3148.7233 3161.9240 3162.3025
redmass: 3.1416 3.2976 1.6208 2.2191 3.2632 3.5191 3.4387 2.3709 1.1886 1.2577 3.0789 3.8581 4.1389 4.2106 2.7711 3.0633 3.1948 3.6889 4.7609 4.5671 2.9058 2.8841 3.4363 3.6713 4.3909 5.6604 5.8072 3.5309 5.1628 5.7001 5.9234 5.7118 1.6818 1.7448 1.9847 2.2434 3.0394 4.1648 1.2499 1.2413 1.4187 1.4501 2.2491 1.4700 1.5825 2.3210 2.7925 3.4198 1.3774 1.6601 2.1165 2.0656 1.4185 1.7714 1.4571 1.6596 1.6070 1.3785 2.6781 1.9152 1.0524 1.0529 1.1168 1.2078 4.2521 3.8468 1.4225 1.4035 4.9810 5.6890 3.4601 3.2095 1.5615 1.3633 2.3388 2.2961 2.2516 1.2081 1.1667 1.2948 1.1571 1.0885 1.4444 2.0180 1.5656 1.1311 5.5630 5.8825 5.9662 6.8887 6.2901 6.2952 1.0409 1.0403 1.0413 1.0980 1.0963 1.0933 1.0946 1.0937 1.0998 1.0843 1.0844 1.0873 1.0873 1.0929 1.0929 1.0958 1.0958 1.1011 1.1011
irintensity: 0.4638 0.1256 0.0919 0.0258 1.9085 2.8517 0.8730 0.5353 0.4688 0.2208 0.0718 3.7345 1.0229 0.0840 1.7307 0.2964 1.7076 1.4702 0.2030 0.6777 0.7241 0.0279 4.5346 7.3422 0.6455 1.5007 0.8668 3.3542 1.8104 11.7960 1.8431 2.8901 18.5102 82.0918 69.1013 16.1227 22.5053 3.4034 0.1096 0.0004 3.4788 6.0506 18.1943 2.4391 6.9102 6.1118 1.0743 0.7488 1.0005 0.2856 1.7952 5.6728 1.3265 3.4090 2.2921 1.1736 15.7066 12.2782 2.4170 1.3309 0.0418 0.0278 0.1915 0.7637 0.1403 3.3863 0.1757 0.7934 1.0034 2.1282 93.9084 3.3222 0.3222 14.6384 9.3785 7.6566 1.3925 25.2090 13.3173 12.7155 8.7469 4.7612 16.2968 25.9745 5.3644 21.3526 49.6033 7.0156 0.0139 1.1353 27.2502 50.8180 56.8594 75.6173 93.9306 16.4916 32.7185 21.7800 11.3104 11.7865 10.2488 4.3048 4.1587 2.4274 0.5989 29.9781 29.5986 49.4116 33.2392 20.8929 16.4480
temp: 298.150 k
press: 1.00000 atm
elementType: 7 6 6 6 6 6 6 6 6 6 6 6 6 6 6 6 6 6 6 6 1 1 1 1 1 1 1 1 1 1 1 1 1 1 1 1 1 1 1
symmnumber: 1
zpe: 845679.2 jmol-1
zpe.correction: 0.322102 hartree
zpe.thermalcorrener: 0.340562 hartree
zpe.thermalcorrenthalpy: 0.341507 hartree
zpe.thermalcorrgfe: 0.275077 hartree
zpe.sumelectzpe: -788.777311 hartree
zpe.sumelectthermal: -788.758851 hartree
zpe.sumelectthermalent: -788.757907 hartree
zpe.sumelectthermalfe: -788.824337 hartree
dipole: 0.2229 3.4038 0.0276
dipole: 3.4112
quadrupole: -112.0919 -97.0414 -118.3589
quadrupole: 1.2032 -5.6142 0.4644
quadrupole: -2.9278 12.1227 -9.1948 1.2032 -5.6142 0.4644
hfenergy: -789.0994136 hartree
pointgroup: C01 [X(C19H19N1)]
dipole: 0.011125 -1.3420231 0.0019565 debye
polarizability: 231.9220237|-0.0956939|266.3045964|39.2372923|0.4496803|145.9020315 unknown
InChI: InChI=1S/C19H19N/c1-14-18(16-10-6-4-7-11-16)19(15(2)20(14)3)17-12-8-5-9-13-17/h4-13H,1-3H3
charge 0 multiplicity 1
39 atoms
N  0.019982 -2.919902 -0.038935
C  -0.71365 -0.772443 -0.124161
C  0.725846 -0.767232 0.109726
C  -1.121603 -2.118148 -0.202478
C  1.151549 -2.109367 0.156362
C  -1.615164 0.402075 -0.184018
C  1.61285 0.41823 0.188961
C  -2.494021 -2.720988 -0.323157
C  2.535955 -2.687489 0.260929
C  0.004805 -4.384599 0.005131
C  -2.6238 0.511553 -1.183522
C  2.598082 0.539377 1.209956
C  -1.504518 1.456103 0.767435
C  1.507326 1.47244 -0.762534
C  -3.496836 1.621548 -1.222396
C  3.454679 1.66126 1.269404
C  -2.369949 2.569104 0.72461
C  2.356102 2.597451 -0.699403
C  -3.375259 2.657542 -0.267762
C  3.338937 2.69738 0.31406
H  -2.67637 -3.492063 0.450398
H  -3.255392 -1.935149 -0.194981
H  -2.670373 -3.196129 -1.309531
H  2.693992 -3.263626 1.194414
H  2.770562 -3.36089 -0.587341
H  3.276044 -1.872028 0.2436
H  -0.705862 -4.781025 -0.739151
H  1.005795 -4.77731 -0.232476
H  -0.287966 -4.761943 1.004194
H  -2.700735 -0.267622 -1.951023
H  2.668782 -0.240645 1.977329
H  -0.736607 1.391965 1.5455
H  0.755965 1.399153 -1.555864
H  -4.262571 1.682822 -2.004642
H  4.20264 1.731679 2.067897
H  -2.263411 3.366722 1.46895
H  2.254033 3.395332 -1.444077
H  -4.048114 3.522003 -0.299525
H  3.998974 3.570959 0.361622
