program: Gaussian 09
title: 000277649
version: EM64L-G09RevD.01
frameworkgroup: C1[X(C4H8I2O2)]
method: RPBEPBE
basis: SDD
operation: Freq
keyword: #pfreq=noraman
keyword: PBEPBE/SDD
title: #p freq=noraman PBEPBE/SDD
converged: NO YES NO NO
title: Mulliken charges:
elementType: I I O O C C C C H H H H H H H H
charge: 0.034410 0.034406 -0.453081 -0.453077 -0.008795 -0.008795 -0.800790 -0.800791 0.241543 0.241539 0.335599 0.296475 0.296475 0.335603 0.354640 0.354640
chargesum: 0.00000
title: Mulliken charges with hydrogens summed into heavy atoms:
elementType: I I O O C C C C
charge: 0.034410 0.034406 -0.098441 -0.098438 0.232748 0.232743 -0.168716 -0.168713
polarizability: 1.72456693e+02 -1.06916900e+01 6.67160482e+01 1.25206511e+01 -3.85674207e+00 5.16571823e+01
1716.lowfreq: -3.6571 -0.0006 -0.0004 -0.0002 4.3322 15.8255 39.9526 58.7744 97.7852
frequency: 39.9526 58.7744 97.7852 101.8875 108.5208 199.1131 224.7940 372.9396 374.0761 392.9524 408.6386 428.1341 503.0290 590.7057 592.7673 806.8521 824.3638 930.9251 953.3742 987.6349 1055.7872 1084.7614 1105.9637 1147.9204 1190.2265 1203.5648 1204.9845 1259.3765 1318.6308 1335.5729 1335.7849 1386.0221 1424.2175 1424.6038 2979.4051 2995.7772 3069.1751 3069.1853 3169.0530 3169.4045 3506.1003 3506.9756
redmass: 8.6123 6.3014 3.3938 5.3174 11.2837 8.4365 4.4102 1.1140 2.1724 1.2331 4.1263 3.6510 3.1962 3.7824 4.7668 2.0281 1.8194 2.1867 1.7775 2.3231 5.5925 3.8046 1.1250 1.4145 1.1521 1.1800 1.1741 1.1898 1.2948 1.2367 1.2413 1.5295 1.1449 1.1138 1.0830 1.0863 1.0570 1.0567 1.1093 1.1092 1.0658 1.0656
irintensity: 0.6071 1.6587 5.6113 0.0000 0.0000 5.5131 0.0000 0.0003 37.4928 302.1614 0.0000 75.5675 0.0000 29.2418 0.0000 0.0000 11.7931 114.3615 0.0000 0.0000 55.7275 0.0000 73.4064 0.0000 60.5991 0.0000 84.0168 0.0000 52.2966 14.1713 0.0019 0.0000 0.0000 37.8604 0.0000 64.4382 3.2154 8.8088 0.0000 2.8858 0.0006 30.6896
temp: 298.150 k
press: 1.00000 atm
elementType: 53 53 8 8 6 6 6 6 1 1 1 1 1 1 1 1
symmnumber: 1
zpe: 310668.5 jmol-1
zpe.correction: 0.118327 hartree
zpe.thermalcorrener: 0.128724 hartree
zpe.thermalcorrenthalpy: 0.129668 hartree
zpe.thermalcorrgfe: 0.078343 hartree
zpe.sumelectzpe: -330.013647 hartree
zpe.sumelectthermal: -330.003251 hartree
zpe.sumelectthermalent: -330.002306 hartree
zpe.sumelectthermalfe: -330.053631 hartree
dipole: 0.0001 0.0000 0.0000
dipole: 0.0001
quadrupole: -83.6402 -78.9338 -78.0090
quadrupole: -4.7685 0.3271 -3.0154
quadrupole: -3.4459 1.2606 2.1853 -4.7685 0.3271 -3.0154
hfenergy: -330.1319746 hartree
pointgroup: C01 [X(C4H8I2O2)]
dipole: 0.0000397 0.0000018 -0.0000062 debye
dipolederiv: -0.5695188 -0.0305749 0.0013322 0.0470055 -0.1483907 0.0127126 -0.0604329 0.0115457 -0.0966334 -0.5692305 -0.0305863 0.0013539 0.0470388 -0.1483971 0.0127131 -0.0605709 0.0115373 -0.0966671 -0.4252089 -0.0074334 0.1182232 -0.0645593 -0.7473281 -0.0447286 0.1638535 -0.0458552 -0.5158415 -0.4253 -0.0074253 0.1181964 -0.0645405 -0.7473385 -0.0447343 0.1638655 -0.0458611 -0.5158496 0.095593 -0.0181159 -0.0589047 0.018511 0.5023322 0.1209486 -0.1261152 0.0779895 0.3607877 0.0955907 -0.0181563 -0.0589093 0.0182928 0.5023763 0.1209376 -0.1260901 0.0779678 0.3607823 0.7439738 -0.1920196 0.1226323 -0.1153 -0.0728673 -0.0469142 0.1622339 -0.0061283 0.0456974 0.7438936 -0.1919761 0.1226261 -0.1152663 -0.0729211 -0.0468793 0.1624371 -0.0061106 0.04576 0.0684217 0.0067976 -0.0115533 -0.0026165 -0.0093627 -0.0037812 0.0170065 -0.036849 -0.1591517 0.0684496 0.0068009 -0.0115468 -0.0025908 -0.009364 -0.0037827 0.0170985 -0.0368331 -0.1591404 0.0171828 0.062486 -0.0221086 0.0051766 0.0067892 -0.0227845 -0.0593433 -0.0146423 0.0975814 -0.0828072 0.0298759 -0.0972196 0.0340214 0.0904099 0.0039533 -0.0040632 0.0310267 -0.0572864 -0.0827917 0.0298664 -0.0972121 0.0340414 0.0904112 0.0039574 -0.0041539 0.030998 -0.0572967 0.0171569 0.0624703 -0.0221219 0.0051846 0.0068318 -0.0228062 -0.0593791 -0.0146352 0.0975625 0.1522878 0.148995 -0.0524014 0.0778029 0.3784062 -0.0194037 -0.0931632 -0.017077 0.3248496 0.152307 0.1489959 -0.0523864 0.0777983 0.3784126 -0.0194079 -0.0931832 -0.0170732 0.324846 unknown
polarizability: 172.5914239|-9.8514385|66.8739046|12.80701|-2.4831707|51.3645949 unknown
InChI: InChI=1S/C4H8I2O2/c5-1-3(7)4(8)2-6/h3-4,7-8H,1-2H2
charge 0 multiplicity 1
16 atoms
I  3.875112 0.070407 0.16089
I  -3.754803 -0.092449 0.002206
O  0.861694 -1.60797 -0.300033
O  -0.741435 1.585991 0.463293
C  0.77737 -0.252836 0.252087
C  -0.657067 0.230886 -0.088888
C  1.805171 0.70555 -0.359956
C  -1.684859 -0.727551 0.523093
H  0.89429 -0.263278 1.355894
H  -0.773962 0.241368 -1.192696
H  1.70004 1.722917 0.039127
H  1.781909 0.69324 -1.460394
H  -1.661629 -0.715274 1.623532
H  -1.579685 -1.744901 0.123977
H  1.795645 -1.931512 -0.194706
H  -1.675393 1.909514 0.357977
