program: Gaussian 09
title: 000277634
version: EM64L-G09RevD.01
frameworkgroup: C1[X(C12H27NO)]
method: RPBEPBE
basis: SDD
operation: Freq
keyword: #p
keyword: freq=noraman
keyword: PBEPBE/SDD
title: #p freq=noraman PBEPBE/SDD
converged: YES YES NO NO
title: Mulliken charges:
elementType: O N C C C C C C C C C C C C H H H H H H H H H H H H H H H H H H H H H H H H H H H
charge: -0.436397 -0.135718 -0.024192 -0.410292 -0.358498 -0.369455 -0.726930 -0.364280 -0.331165 -0.355188 -0.356239 -0.336270 -0.668782 -0.696499 0.192630 0.184369 0.194752 0.216187 0.180846 0.185394 0.184186 0.217813 0.216657 0.210064 0.192494 0.217250 0.208852 0.187614 0.188040 0.189155 0.193946 0.194353 0.212867 0.198015 0.208054 0.224310 0.207004 0.214580 0.209608 0.210210 0.330655
chargesum: 0.00000
title: Mulliken charges with hydrogens summed into heavy atoms:
elementType: O N C C C C C C C C C C C C
charge: -0.105742 -0.135718 0.168437 -0.031171 0.038535 0.000125 -0.082396 0.045464 0.065301 0.022007 0.032061 0.074612 -0.029414 -0.062101
polarizability: 1.56990206e+02 2.90337810e+00 1.36351536e+02 1.13537835e-01 -8.47477665e-01 1.35297127e+02
1716.lowfreq: -11.1359 -6.4536 0.0007 0.0009 0.0010 8.1945 20.8073 32.9218 48.0871
frequency: 20.7431 32.0484 47.8555 54.6599 60.2585 84.8774 90.5171 105.3373 113.9617 139.4354 152.7045 177.4715 195.6050 218.0587 225.2079 229.6063 268.2736 277.5814 284.7849 309.3451 339.6899 367.5055 423.4321 457.1348 473.9606 519.3897 546.4626 715.1564 723.2703 741.9739 789.6171 790.0996 800.0413 864.0786 871.4787 890.3835 924.9476 952.7354 957.9439 983.5519 998.8474 1021.7964 1025.6095 1049.7008 1056.0852 1068.3899 1073.1303 1080.7152 1085.6964 1100.6385 1119.0916 1123.6883 1150.0889 1186.5547 1209.9825 1220.7913 1232.0643 1245.9272 1270.0205 1277.2012 1280.0209 1282.9219 1287.4633 1290.4901 1300.0823 1304.1705 1333.4726 1351.6196 1353.3515 1354.7065 1365.1301 1368.0637 1374.1650 1383.5026 1386.7293 1389.0578 1453.8037 1462.6815 1464.4238 1465.2487 1467.8747 1470.9618 1473.4370 1474.9151 1476.4559 1477.4452 1481.0543 1485.0490 1489.1868 1491.0097 2866.5492 2907.4518 2946.0722 2953.1846 2956.0068 2962.6352 2967.5538 2971.0484 2972.4274 2976.5530 2981.3691 2984.3232 2987.5815 3000.5163 3008.2793 3011.2732 3025.4711 3026.9143 3042.6857 3067.7666 3068.8668 3069.4766 3069.7247 3074.3278 3082.3540 3089.5579 3561.0628
redmass: 4.4900 2.5934 2.0239 2.0207 2.8520 3.2686 2.2214 2.6644 1.6418 2.1163 2.3072 1.6467 1.2774 1.6407 2.9015 1.1466 2.1246 2.5866 2.1673 1.3653 2.9433 2.7422 3.0976 2.8238 3.0315 3.0036 2.4911 1.7200 1.1408 1.2602 1.1607 1.2131 1.2267 1.5315 1.5136 1.9323 1.8718 1.4159 3.6612 1.9630 2.4119 2.3680 2.2631 1.7604 2.5062 2.4598 2.4990 2.1302 2.0336 1.6987 2.4193 1.5036 2.3885 1.9102 1.8957 1.5666 1.5646 1.3645 1.2861 1.0847 1.2025 1.1578 1.1420 1.1008 1.2230 1.3016 1.4439 1.6074 1.6123 1.2957 1.3270 1.3252 1.2432 1.2469 1.2474 1.2172 1.0776 1.0692 1.0507 1.0732 1.0695 1.0511 1.0669 1.0648 1.0426 1.0514 1.0795 1.0801 1.0908 1.0795 1.0712 1.0673 1.0590 1.0599 1.0610 1.0615 1.0591 1.0365 1.0369 1.0661 1.0385 1.0958 1.0814 1.0980 1.0956 1.0933 1.0881 1.1036 1.1027 1.1006 1.0996 1.0992 1.0993 1.0984 1.0989 1.1003 1.0662
irintensity: 0.3189 0.1075 0.3943 0.3983 0.1136 1.1961 5.1849 0.4162 0.0204 1.7317 0.3943 0.1585 0.0316 0.1433 0.2046 0.0013 3.6632 2.6797 3.0101 131.7639 1.8499 19.4769 5.2872 3.6003 4.5944 4.3098 4.6613 7.1230 10.2207 1.2125 6.2347 7.4700 2.9687 5.6124 0.5728 2.8174 13.2038 5.5334 100.8307 5.6858 4.2615 21.8145 5.0554 16.0391 10.9429 2.5830 4.7264 0.5537 8.5097 39.6330 22.6074 0.4965 33.5391 6.6047 26.7943 13.5278 12.0361 4.3278 0.1143 0.3541 8.1486 0.5270 1.7092 4.9153 13.0689 5.4158 3.0288 4.2059 4.3493 14.6398 7.4895 3.8318 9.7202 1.4777 34.5303 11.1120 0.8786 0.2900 6.9201 0.8598 0.4028 10.3681 5.1124 7.0736 12.0497 1.5931 1.1922 4.6277 30.7602 7.7033 94.0748 68.5269 5.3657 5.5203 0.3037 17.2506 126.7088 41.8895 27.1030 85.3972 18.4520 2.2832 31.7032 9.1069 17.2676 21.9399 19.6713 8.0576 112.9081 82.9226 47.2813 57.9322 55.4490 56.2440 52.9581 43.4140 6.6600
temp: 298.150 k
press: 1.00000 atm
elementType: 8 7 6 6 6 6 6 6 6 6 6 6 6 6 1 1 1 1 1 1 1 1 1 1 1 1 1 1 1 1 1 1 1 1 1 1 1 1 1 1 1
symmnumber: 1
zpe: 977867.8 jmol-1
zpe.correction: 0.372450 hartree
zpe.thermalcorrener: 0.391784 hartree
zpe.thermalcorrenthalpy: 0.392728 hartree
zpe.thermalcorrgfe: 0.322853 hartree
zpe.sumelectzpe: -602.220697 hartree
zpe.sumelectthermal: -602.201363 hartree
zpe.sumelectthermalent: -602.200419 hartree
zpe.sumelectthermalfe: -602.270294 hartree
dipole: 0.5021 -1.8781 -1.0994
dipole: 2.2334
quadrupole: -96.0483 -97.6326 -88.3815
quadrupole: 7.5311 -0.0397 -4.0079
quadrupole: -2.0275 -3.6118 5.6393 7.5311 -0.0397 -4.0079
hfenergy: -602.593147 hartree
pointgroup: C01 [X(C12H27N1O1)]
dipole: -0.2156419 -0.7101018 0.4704786 debye
polarizability: 156.956563|-2.6162756|136.3802672|1.624055|0.6138348|135.3020396 unknown
InChI: InChI=1S/C12H27NO/c1-4-6-7-8-9-12(3)13(5-2)10-11-14/h12,14H,4-11H2,1-3H3
charge 0 multiplicity 1
41 atoms
O  2.460435 3.532023 0.276971
N  1.979989 -0.221371 -0.093069
C  1.420752 -1.284658 0.796261
C  -0.006888 -0.924474 1.285791
C  -1.037512 -0.783337 0.145732
C  -2.428748 -0.323082 0.635306
C  2.347198 -1.658604 1.988981
C  2.365128 1.045483 0.569949
C  2.984818 -0.70281 -1.076131
C  -3.459706 -0.17715 -0.506813
C  -4.850549 0.291905 -0.021631
C  1.969925 2.264775 -0.292571
C  2.360808 -1.476559 -2.255097
C  -5.870589 0.445088 -1.170675
H  1.321107 -2.184427 0.156752
H  0.028111 0.019196 1.870409
H  -0.338172 -1.710435 1.995507
H  -0.63953 -0.068748 -0.600988
H  -1.138309 -1.757167 -0.378825
H  -2.815812 -1.04227 1.388049
H  -2.32774 0.650044 1.161645
H  1.961752 -2.552073 2.514251
H  3.373353 -1.885617 1.645044
H  2.407497 -0.837202 2.727247
H  1.845056 1.121131 1.544862
H  3.456679 1.10758 0.788742
H  3.509452 0.183879 -1.478632
H  3.772021 -1.333302 -0.59178
H  -3.56546 -1.148812 -1.033568
H  -3.073129 0.541756 -1.259299
H  -4.742447 1.259413 0.510316
H  -5.238137 -0.430844 0.725408
H  2.447161 2.212322 -1.285136
H  0.869491 2.277219 -0.435547
H  1.845818 -2.394794 -1.919701
H  1.620897 -0.844286 -2.7765
H  3.143815 -1.77731 -2.976497
H  -6.856068 0.780675 -0.798091
H  -6.018415 -0.515506 -1.699733
H  -5.520174 1.185455 -1.914604
H  2.030923 3.6761 1.157768
