program: Gaussian 09
title: 000277632
version: EM64L-G09RevD.01
frameworkgroup: C1[X(C12H25NO)]
method: RPBEPBE
basis: SDD
operation: Freq
keyword: #p
keyword: freq=noraman
keyword: PBEPBE/SDD
title: #p freq=noraman PBEPBE/SDD
converged: YES YES NO NO
title: Mulliken charges:
elementType: O N C C C C C C C C C C C C H H H H H H H H H H H H H H H H H H H H H H H H H
charge: -0.440720 -0.332945 -0.052033 -0.173650 -0.034666 -0.477700 -0.428127 -0.419718 -0.011672 -0.773556 -0.746646 -0.757424 -0.372568 -0.337638 0.187987 0.221338 0.201846 0.212662 0.199091 0.193310 0.195170 0.220672 0.201156 0.196841 0.244683 0.220842 0.219063 0.213318 0.212695 0.208849 0.210675 0.210865 0.208598 0.231514 0.205580 0.197894 0.205179 0.206168 0.333066
chargesum: 0.00000
title: Mulliken charges with hydrogens summed into heavy atoms:
elementType: O N C C C C C C C C C C C C
charge: -0.107654 -0.088262 0.135954 0.047687 0.167180 -0.065947 -0.039648 -0.021720 0.209000 -0.120333 -0.114427 -0.106447 0.030907 0.073709
polarizability: 1.51630500e+02 6.31120058e-01 1.41302401e+02 6.10095471e-01 7.91264291e-01 1.20637636e+02
1716.lowfreq: -0.4942 0.0006 0.0007 0.0009 12.7323 22.8511 37.3013 48.9830 67.5086
frequency: 37.0524 48.9293 67.3815 84.8434 98.7579 133.4898 158.7967 176.0934 202.8279 214.8913 228.3716 240.0692 251.9015 278.5338 295.4453 298.7099 311.8413 337.1277 376.8462 414.8903 436.4944 465.6877 507.2862 536.6460 571.5721 605.8834 651.8982 783.1751 792.2105 811.9014 843.9029 866.7260 880.1037 892.5924 911.6230 946.7170 955.2361 960.7458 973.0156 997.8668 1021.0421 1034.6544 1051.0851 1054.1942 1065.3678 1075.5099 1080.5971 1111.7456 1127.5619 1143.7219 1150.6647 1173.6067 1192.4157 1199.3358 1221.2874 1242.5339 1268.3806 1274.7506 1282.9620 1284.2951 1297.7687 1302.9873 1315.5435 1332.6472 1333.5477 1339.3449 1351.8221 1359.7278 1361.7164 1363.3877 1376.1300 1384.2208 1389.1376 1393.7914 1451.9711 1459.8623 1465.5578 1468.3543 1470.3960 1474.7660 1475.3433 1482.7429 1486.5031 1487.1357 1489.0106 1493.1370 2891.3169 2918.5791 2943.9508 2951.3078 2965.2949 2968.0614 2969.5788 2973.9785 2975.8467 2978.9745 2980.4570 2988.5817 2992.4739 3017.7170 3027.7121 3039.0098 3058.2557 3059.3774 3062.7940 3066.4027 3068.8768 3074.0537 3075.4132 3430.8111 3563.7764
redmass: 2.5932 3.5747 2.9352 2.0244 2.8830 2.5904 2.8120 2.5606 1.2429 1.1861 1.0770 2.8177 2.5210 3.2021 2.2422 2.1894 1.2448 2.5780 2.0677 2.8727 2.2140 3.3602 3.0958 2.5947 2.4482 2.2277 1.4576 2.2751 2.7359 1.1714 1.5272 2.2052 2.1943 2.0710 1.2069 2.0759 1.5091 2.5267 1.6360 1.8639 2.2537 1.9267 2.0420 1.9156 1.4399 1.8699 1.5275 1.6378 1.8211 3.2421 2.2589 1.8288 2.0538 1.7345 1.6984 1.3881 1.3155 1.2014 1.2604 1.2522 1.2496 1.2695 1.4016 1.4401 1.4450 1.3736 1.3381 1.4502 1.3278 1.3879 1.2202 1.3264 1.2272 1.2189 1.1951 1.0897 1.0494 1.0760 1.0740 1.0560 1.0830 1.0530 1.0784 1.0525 1.0529 1.0663 1.0672 1.0804 1.0820 1.0717 1.0356 1.0702 1.0586 1.0562 1.0413 1.0456 1.0704 1.0831 1.0836 1.0983 1.0979 1.1025 1.0990 1.0992 1.0980 1.0980 1.1025 1.0985 1.0987 1.0734 1.0662
irintensity: 0.3646 0.4787 0.7259 4.8246 2.4369 1.9961 1.8152 1.6159 0.3335 0.1319 0.0475 0.9263 0.1370 0.3219 2.0580 5.4753 123.5211 32.5585 6.7494 7.7582 8.6662 0.0960 7.7582 7.6408 2.7672 3.2782 94.9708 3.7717 14.6242 3.0783 14.2246 4.7208 7.6829 0.8177 5.8088 27.3317 10.3494 58.6653 8.1178 2.1418 10.6278 8.1329 6.4040 2.1445 0.5279 10.6098 16.4738 2.0270 57.6201 30.7526 12.6726 2.5161 9.6944 4.4171 3.3333 2.6228 4.1727 1.8225 1.0097 1.4703 0.2257 5.9800 10.9679 0.3608 5.3130 0.1457 5.2253 0.2110 5.1005 0.7245 20.0317 4.3303 22.4124 24.0659 27.1686 4.5424 7.1201 5.4496 3.1098 4.3450 16.9240 2.7643 5.9580 10.0835 13.8045 2.3184 71.3343 13.9076 35.1666 11.7030 37.1208 83.0827 18.5457 23.5591 64.4953 13.1423 58.7961 38.3608 8.6857 58.8744 52.5278 76.2281 39.5622 4.4101 35.7238 101.5273 43.6624 43.6018 52.7296 0.7651 7.5951
temp: 298.150 k
press: 1.00000 atm
elementType: 8 7 6 6 6 6 6 6 6 6 6 6 6 6 1 1 1 1 1 1 1 1 1 1 1 1 1 1 1 1 1 1 1 1 1 1 1 1 1
symmnumber: 1
zpe: 929217.0 jmol-1
zpe.correction: 0.353920 hartree
zpe.thermalcorrener: 0.370727 hartree
zpe.thermalcorrenthalpy: 0.371671 hartree
zpe.thermalcorrgfe: 0.309983 hartree
zpe.sumelectzpe: -601.056340 hartree
zpe.sumelectthermal: -601.039533 hartree
zpe.sumelectthermalent: -601.038589 hartree
zpe.sumelectthermalfe: -601.100277 hartree
dipole: 1.5629 -0.5737 -0.8868
dipole: 1.8863
quadrupole: -103.9864 -91.1285 -85.1449
quadrupole: -1.2918 6.1653 0.0578
quadrupole: -10.5665 2.2914 8.2750 -1.2918 6.1653 0.0578
hfenergy: -601.4102599 hartree
pointgroup: C01 [X(C12H25N1O1)]
dipole: 0.5840504 0.2789048 0.3631418 debye
polarizability: 151.6742689|0.298682|141.2656209|0.0010043|0.8421892|120.6306472 unknown
InChI: InChI=1S/C12H25NO/c1-9(2)11-6-4-5-10(3)12(11)13-7-8-14/h9-14H,4-8H2,1-3H3
charge 0 multiplicity 1
39 atoms
O  -4.952954 -0.737457 0.071686
N  -1.21548 -0.378108 -0.401914
C  1.282484 -0.296083 -0.324893
C  -0.051808 0.292971 0.228997
C  -0.092446 1.861939 0.130221
C  2.48885 0.365908 0.397105
C  1.142957 2.474056 0.843294
C  2.471022 1.908031 0.293482
C  1.317692 -1.860624 -0.280654
C  -0.246003 2.379317 -1.321134
C  2.543809 -2.425692 -1.03791
C  1.243627 -2.444722 1.151229
C  -2.550741 -0.03979 0.124592
C  -3.58265 -1.088426 -0.337701
H  1.349232 -0.016795 -1.402183
H  -0.097548 0.047933 1.312951
H  -0.994811 2.195999 0.686053
H  3.434994 -0.027249 -0.020391
H  2.472028 0.082377 1.469774
H  1.083567 2.246108 1.928431
H  1.120643 3.578083 0.748551
H  0.403556 -2.198975 -0.807373
H  2.605755 2.213142 -0.763672
H  3.325246 2.334706 0.854653
H  -1.178662 -0.314227 -1.429088
H  -0.314239 3.482997 -1.327566
H  0.604859 2.096325 -1.966741
H  -1.16925 1.991823 -1.792053
H  2.466982 -3.524832 -1.136694
H  2.620405 -1.999885 -2.057144
H  3.491246 -2.208807 -0.509243
H  2.118357 -2.152332 1.762197
H  1.223222 -3.549941 1.111042
H  0.327514 -2.115315 1.673256
H  -2.927766 0.969945 -0.166227
H  -2.488264 -0.049865 1.232856
H  -3.285421 -2.091299 0.03083
H  -3.631205 -1.123718 -1.440349
H  -5.0065 -0.754816 1.060428
