program: Gaussian 09
title: 000277666
version: EM64L-G09RevD.01
frameworkgroup: C1[X(C21H15N5O2)]
method: RPBEPBE
basis: SDD
operation: Freq
keyword: #p
keyword: freq=noraman
keyword: PBEPBE/SDD
title: #p freq=noraman PBEPBE/SDD
converged: YES YES NO NO
title: Mulliken charges:
elementType: O O N N N N N C C C C C C C C C C C C C C C C C C C C C H H H H H H H H H H H H H H H
charge: -0.166031 -0.288359 -0.400223 -0.083382 0.048304 -0.075230 0.049508 0.420101 0.383715 0.392512 0.385905 -0.619627 0.471712 -0.383951 -0.406620 -0.406421 -0.386507 -0.456202 -0.397465 -0.396841 -0.408059 0.115097 -0.237256 -0.237316 -0.366222 -0.241747 -0.232205 0.084288 0.247796 0.243334 0.242957 0.245368 0.294597 0.296682 0.240018 0.248164 0.241454 0.233791 0.253380 0.233540 0.232686 0.231036 0.353722
chargesum: 0.00000
title: Mulliken charges with hydrogens summed into heavy atoms:
elementType: O O N N N N N C C C C C C C C C C C C C C C C C C C C C
charge: -0.166031 -0.288359 -0.046501 -0.083382 0.048304 -0.075230 0.049508 0.420101 0.383715 0.392512 0.385905 -0.371830 0.471712 -0.140617 -0.163663 -0.161054 -0.091910 -0.159521 -0.157447 -0.148677 -0.166605 0.115097 -0.003464 -0.003776 -0.112842 -0.009061 -0.001169 0.084288
polarizability: 9.14975391e+02 -2.21975089e+01 3.22205821e+02 -4.36149337e+00 7.72824588e+00 1.03293399e+02
1716.lowfreq: -8.3419 -4.9296 -0.0006 0.0004 0.0013 1.6371 5.3680 19.8140 25.5425
frequency: 3.0927 19.7632 25.4893 39.3888 51.1697 71.4005 75.5140 116.0620 127.2430 144.3538 174.4517 186.7110 190.4667 196.5122 233.5917 268.3761 296.8753 327.3954 348.9932 353.7729 381.3437 401.1054 410.2272 428.2305 463.4283 475.5051 479.7525 482.4130 496.0995 508.1445 514.4798 533.6187 536.4970 540.9816 613.4452 622.0743 650.0529 656.6447 660.1466 678.2931 695.4065 743.4047 754.9320 757.5084 760.5413 764.0359 782.7582 785.8636 787.9208 836.0570 837.9789 844.3387 873.7927 885.3144 889.5647 902.7284 919.6902 929.3428 942.9364 947.0124 963.2705 965.9792 971.2624 986.0137 993.1077 996.1047 1000.8862 1021.4853 1024.0481 1051.8415 1098.6315 1120.3620 1122.0788 1146.1128 1154.4235 1161.9623 1173.9537 1174.6300 1182.1455 1226.4452 1238.4772 1243.3803 1267.1879 1272.8825 1275.9366 1298.3750 1334.5512 1342.0365 1354.4005 1361.2797 1410.3711 1412.3115 1420.8208 1422.4816 1439.3965 1441.9813 1447.7122 1452.5905 1469.9840 1496.2628 1513.8395 1522.1708 1567.6180 1583.0177 1596.3126 1604.4058 1628.8029 1634.9764 3123.9721 3124.3793 3125.3545 3130.0088 3130.7821 3132.7813 3136.8655 3146.3026 3147.1882 3150.0748 3162.1182 3164.7332 3166.0418 3166.4984 3182.7873
redmass: 5.2056 6.3306 4.5062 8.7326 5.7948 7.3040 8.2295 7.7389 7.0433 7.7919 6.2951 3.7939 5.5683 5.1685 7.6263 6.4168 6.9310 5.1039 6.6775 4.7255 5.4097 3.2104 3.4397 6.7081 5.0348 2.4823 3.4089 6.0989 7.8592 7.1146 6.6793 3.6171 7.1698 4.0272 6.9260 6.7352 8.1557 2.9174 3.0965 8.3009 8.2130 7.2712 4.8248 4.8916 1.3069 1.3390 2.4827 6.2324 2.7092 1.3200 1.2881 7.8928 1.4940 1.6201 4.9265 1.6472 5.3905 1.3086 1.4876 3.9760 4.0923 1.3936 1.4406 1.3749 1.3377 1.3620 1.3541 2.2905 2.2849 4.8120 6.8493 1.9354 1.7555 1.2519 1.2375 2.0848 1.1088 1.1206 1.5993 2.6174 1.9616 1.6487 2.3967 1.7607 1.8111 2.4424 7.0465 4.9933 2.1611 2.0673 5.6580 5.3771 3.7882 3.8434 4.0666 3.6836 2.7650 2.2877 3.7379 2.5407 3.8563 3.3356 7.0477 7.2640 5.9765 5.5968 6.6470 6.7085 1.0861 1.0900 1.0880 1.0893 1.0889 1.0885 1.0901 1.0953 1.0948 1.0917 1.0783 1.1002 1.1003 1.0965 1.0954
irintensity: 0.5163 0.5160 0.1055 0.4784 0.0573 1.1624 0.0247 1.6875 0.7215 3.7338 0.9354 0.9180 1.6934 3.7465 0.4659 2.5420 5.2082 0.6165 0.8922 3.2176 14.1109 1.6394 1.7042 20.5820 46.0618 8.0817 14.4136 4.9020 36.2803 4.8149 0.9504 0.7184 3.7246 0.1036 5.7472 0.8748 17.9841 0.8090 1.1641 27.2963 1.9111 4.8500 4.8317 4.2570 53.7857 56.1989 0.3575 15.7377 0.3620 28.0564 38.2932 31.5896 46.0237 25.8339 6.2137 6.3971 3.5175 100.7035 13.0752 18.0983 5.6504 13.8378 16.4092 2.0184 0.1001 0.0487 0.0117 4.8276 1.7321 213.2648 241.5413 35.7206 31.5739 10.0751 8.5646 32.2796 0.7707 6.9483 2.2506 2.7154 0.6818 1.4543 3.0119 5.3948 15.8283 34.7391 79.8843 25.8103 13.9306 39.7858 12.8562 54.2825 62.7485 1.7278 6.0890 35.7748 240.5368 159.2883 218.5200 223.9699 10.5205 0.1324 19.0161 6.7741 11.9816 5.2930 48.8868 8.1763 2.9567 0.9130 8.9973 0.3205 0.1300 9.4495 6.0682 26.7568 26.8811 0.3402 138.2684 54.5477 55.8472 10.2930 4.5928
temp: 298.150 k
press: 1.00000 atm
elementType: 8 8 7 7 7 7 7 6 6 6 6 6 6 6 6 6 6 6 6 6 6 6 6 6 6 6 6 6 1 1 1 1 1 1 1 1 1 1 1 1 1 1 1
symmnumber: 1
zpe: 832615.4 jmol-1
zpe.correction: 0.317126 hartree
zpe.thermalcorrener: 0.339301 hartree
zpe.thermalcorrenthalpy: 0.340245 hartree
zpe.thermalcorrgfe: 0.261121 hartree
zpe.sumelectzpe: -1231.398244 hartree
zpe.sumelectthermal: -1231.376070 hartree
zpe.sumelectthermalent: -1231.375126 hartree
zpe.sumelectthermalfe: -1231.454250 hartree
dipole: 2.3349 -4.3710 0.3743
dipole: 4.9697
quadrupole: -102.4805 -160.0052 -168.0200
quadrupole: 4.4711 -1.2726 2.4515
quadrupole: 41.0214 -16.5033 -24.5181 4.4711 -1.2726 2.4515
hfenergy: -1231.7153709 hartree
pointgroup: C01 [X(C21H15N5O2)]
dipole: 0.8702359 1.3104511 -1.1611646 debye
polarizability: 912.9021409|17.0120162|254.8396668|-39.9445709|-102.1491277|172.7328031 unknown
InChI: InChI=1S/C21H15N5O2/c27-26(28)21(24-22-19-11-9-15-5-1-3-7-17(15)13-19)25-23-20-12-10-16-6-2-4-8-18(16)14-20/h1-14,22H
charge 0 multiplicity 1
43 atoms
O  -1.014723 -2.988517 2.60386
O  1.245578 -2.889488 2.273197
N  2.202575 -0.97123 0.848364
N  -1.659162 0.264254 0.402636
N  0.931962 -0.596781 0.684698
N  -1.444986 -0.893571 0.986264
N  0.012604 -2.440231 2.077117
C  5.656668 0.024245 -0.157793
C  5.381465 1.192947 -0.971972
C  -5.451275 0.048247 0.214218
C  -5.715944 1.315878 -0.446856
C  4.565596 -0.680766 0.437313
C  3.247451 -0.244581 0.234439
C  4.015866 1.604193 -1.15389
C  7.018125 -0.390186 0.027263
C  6.474775 1.898629 -1.56678
C  2.962998 0.910403 -0.569369
C  -4.107006 -0.32376 0.50318
C  -4.608796 2.164857 -0.788733
C  -6.55953 -0.800325 0.560434
C  -7.071102 1.678844 -0.734228
C  -3.041469 0.530263 0.155254
C  8.064622 0.319547 -0.566439
C  7.792373 1.472613 -1.369306
C  -3.302845 1.785475 -0.494771
C  -7.868816 -0.418057 0.267222
C  -8.126737 0.831384 -0.385594
C  -0.112015 -1.239893 1.215459
H  4.768253 -1.565078 1.054644
H  3.809456 2.48743 -1.769341
H  7.226849 -1.273304 0.64258
H  6.265164 2.781686 -2.181772
H  1.921547 1.214763 -0.699056
H  -3.882301 -1.272817 1.002169
H  -4.808059 3.121285 -1.285595
H  -6.356785 -1.754765 1.060191
H  -7.270473 2.63489 -1.232718
H  9.100739 -0.003804 -0.419836
H  -2.445306 2.418191 -0.744214
H  8.622588 2.019831 -1.828533
H  -8.706953 -1.070426 0.534586
H  -9.159736 1.11934 -0.60983
H  2.377163 -1.816409 1.43864
