program: Gaussian 09
title: 000277629
version: EM64L-G09RevD.01
frameworkgroup: C1[X(C12H20N2O3)]
method: RPBEPBE
basis: SDD
operation: Freq
keyword: #p
keyword: freq=noraman
keyword: PBEPBE/SDD
title: #p freq=noraman PBEPBE/SDD
converged: YES YES NO NO
title: Mulliken charges:
elementType: O O O N N C C C C C C C C C C C C H H H H H H H H H H H H H H H H H H H H
charge: -0.210758 -0.204758 -0.218871 -0.369075 -0.364655 0.023429 -0.492202 -0.463480 -0.272472 -0.398996 -0.387156 -0.345120 -0.714980 0.161413 0.139678 -0.698153 0.175711 0.229715 0.214374 0.258709 0.217881 0.204733 0.290646 0.195241 0.203608 0.199598 0.209296 0.193865 0.194196 0.220462 0.217054 0.216346 0.366234 0.368765 0.214313 0.216412 0.208997
chargesum: 0.00000
title: Mulliken charges with hydrogens summed into heavy atoms:
elementType: O O O N N C C C C C C C C C C C C
charge: -0.210758 -0.204758 -0.218871 -0.002841 0.004110 0.253144 -0.019119 -0.040867 0.018174 -0.000147 0.021738 0.042941 -0.061117 0.161413 0.139678 -0.058430 0.175711
polarizability: 1.90853253e+02 1.97382825e+00 1.43511318e+02 -4.76213689e+00 1.12009407e+01 1.23943227e+02
1716.lowfreq: -9.4967 -0.0006 0.0005 0.0007 7.8497 16.5228 24.2491 28.4894 35.5730
frequency: 23.3295 28.3119 35.3630 58.5477 61.3641 94.5716 104.9126 131.9871 141.9809 146.2251 163.0001 200.9082 210.6159 232.7545 248.0081 280.9798 314.3588 352.4582 357.5015 384.8607 403.0381 460.9178 473.5170 494.2373 539.7777 584.5565 605.9515 657.2387 682.3583 707.8355 727.1986 753.1530 764.2325 775.7590 787.6351 808.2238 847.1898 893.9347 904.7581 922.2151 946.4624 968.5382 980.3353 993.8117 1021.8044 1028.3636 1054.7755 1061.5794 1080.0157 1108.6388 1145.3639 1159.4197 1172.3235 1211.0279 1222.9588 1246.9345 1255.8582 1275.1891 1280.9992 1283.6941 1290.1913 1299.8584 1309.7937 1330.1757 1341.8039 1342.6221 1354.2571 1362.4053 1366.4034 1375.0866 1376.8430 1388.2446 1390.3156 1463.4248 1467.9838 1472.4589 1475.0424 1476.3350 1477.7845 1485.4712 1486.9510 1505.5232 1629.2396 1654.3838 1676.5778 2957.1089 2964.1387 2966.7228 2972.2501 2974.3766 2977.5464 2982.1459 2987.2996 2995.8500 3015.5156 3017.9370 3037.3579 3047.6551 3065.9228 3068.7858 3071.2742 3071.9633 3075.6387 3520.9156 3523.4497
redmass: 5.7461 5.7319 3.9165 2.7379 1.8286 2.4035 3.6326 2.6342 5.4747 3.8517 3.2544 2.9823 2.2381 1.1208 1.9035 3.1405 2.5098 6.3363 7.5725 2.9553 4.8509 2.7592 8.1125 5.0763 2.3635 4.3816 9.6844 2.5822 2.2185 5.5133 1.0821 1.6140 1.2733 1.6851 1.6527 1.8308 2.2159 1.8879 1.7039 2.1539 2.2436 2.2407 3.2894 2.9438 1.9585 1.8889 1.9355 2.7822 2.0058 1.7438 2.4293 1.9311 1.6409 2.4264 1.4588 1.3592 1.4590 1.2947 1.2528 1.1794 1.2687 1.0958 2.6258 1.4392 1.4307 1.5042 1.4823 5.6761 1.4539 1.5697 2.2416 1.2196 1.2094 1.0784 1.0707 1.0527 1.0610 1.0470 1.0589 1.0693 1.0748 1.0796 6.5866 8.8307 5.6327 1.0585 1.0598 1.0600 1.0364 1.0655 1.0435 1.0604 1.0723 1.0965 1.1008 1.0982 1.1022 1.0982 1.0853 1.1005 1.0993 1.0995 1.0998 1.0761 1.0780
irintensity: 0.1779 0.0396 0.3551 0.3636 0.0244 0.0778 0.2662 0.3665 0.8704 7.3658 3.9193 0.2951 0.2682 0.0523 0.6432 1.6008 1.1502 14.2807 21.5575 0.8727 5.6436 6.0636 14.2018 39.1799 7.9824 6.3536 3.4636 0.7192 39.5378 4.7577 10.0929 2.5217 1.3673 23.3297 190.9103 8.7118 3.1488 6.3786 1.7592 11.4611 2.7664 2.0112 2.2913 4.4559 4.7217 14.3694 2.2971 2.4866 1.1895 25.9873 21.0832 1.1802 26.9574 39.2010 20.8813 1.6321 51.8647 2.8069 28.1365 1.3570 12.1241 0.9651 304.3285 27.1599 11.7803 19.6697 9.5251 185.5774 3.7395 29.4535 16.0862 12.6993 13.0280 1.3895 1.4029 3.3279 2.8688 14.2061 10.1944 14.0070 13.4772 20.5352 328.7975 119.9150 625.7766 0.5919 3.9947 68.1652 37.2264 15.2298 26.7913 31.3592 28.2870 4.2517 10.8439 20.1370 87.1140 19.2783 3.9505 75.0685 52.4059 55.1556 57.9519 82.9888 51.6540
temp: 298.150 k
press: 1.00000 atm
elementType: 8 8 8 7 7 6 6 6 6 6 6 6 6 6 6 6 6 1 1 1 1 1 1 1 1 1 1 1 1 1 1 1 1 1 1 1 1
symmnumber: 1
zpe: 819184.1 jmol-1
zpe.correction: 0.312011 hartree
zpe.thermalcorrener: 0.330512 hartree
zpe.thermalcorrenthalpy: 0.331456 hartree
zpe.thermalcorrgfe: 0.263225 hartree
zpe.sumelectzpe: -803.173482 hartree
zpe.sumelectthermal: -803.154981 hartree
zpe.sumelectthermalent: -803.154037 hartree
zpe.sumelectthermalfe: -803.222268 hartree
dipole: -1.1855 0.9821 -0.6257
dipole: 1.6618
quadrupole: -112.6426 -107.7001 -107.7514
quadrupole: -2.0211 1.4770 -5.4200
quadrupole: -3.2779 1.6646 1.6133 -2.0211 1.4770 -5.4200
hfenergy: -803.4854932 hartree
pointgroup: C01 [X(C12H20N2O3)]
dipole: 0.4697998 0.3703943 0.2636948 debye
polarizability: 190.7940456|-2.0769488|144.6120013|-5.1515719|-10.1220587|122.9017508 unknown
InChI: InChI=1S/C12H20N2O3/c1-3-5-6-8(4-2)7-9-10(15)13-12(17)14-11(9)16/h8-9,13-14H,3-7H2,1-2H3
charge 0 multiplicity 1
37 atoms
O  -0.966524 1.222798 -2.042082
O  -1.052545 -2.426585 1.104472
O  -4.86382 0.103356 0.237247
N  -2.865104 0.701302 -0.821728
N  -2.920252 -1.116009 0.693683
C  1.273334 1.306464 0.237862
C  0.141197 0.429224 0.83952
C  2.244424 0.502066 -0.673271
C  -0.711562 -0.387077 -0.207249
C  1.988222 2.037683 1.412593
C  2.953964 -0.705829 -0.016159
C  3.935581 -1.40778 -0.984006
C  3.028421 3.088341 0.968549
C  -1.492141 0.555777 -1.114056
C  -1.548289 -1.407186 0.560275
C  4.632863 -2.631881 -0.3527
C  -3.635746 -0.083532 0.057182
H  0.809476 2.085027 -0.402101
H  -0.541715 1.066773 1.436561
H  0.574331 -0.317625 1.531422
H  1.691252 0.159211 -1.5714
H  3.013614 1.197543 -1.063549
H  -0.001855 -0.950886 -0.836014
H  1.216475 2.542204 2.029991
H  2.47356 1.294191 2.076561
H  3.512608 -0.37663 0.88369
H  2.210547 -1.45087 0.335919
H  4.698647 -0.676964 -1.322031
H  3.385131 -1.72274 -1.894358
H  3.887166 2.625383 0.450319
H  3.426056 3.638719 1.840975
H  2.577641 3.82767 0.279787
H  -3.385165 1.402584 -1.359534
H  -3.478128 -1.74415 1.281473
H  3.891396 -3.389246 -0.035566
H  5.326514 -3.11493 -1.065291
H  5.216026 -2.339897 0.541213
