program: Gaussian 09
title: 000277616
version: EM64L-G09RevD.01
frameworkgroup: C1[X(C11H23NO)]
method: RPBEPBE
basis: SDD
operation: Freq
keyword: #p
keyword: freq=noraman
keyword: PBEPBE/SDD
title: #p freq=noraman PBEPBE/SDD
converged: YES YES NO NO
title: Mulliken charges:
elementType: O N C C C C C C C C C C C H H H H H H H H H H H H H H H H H H H H H H H
charge: -0.436242 -0.151631 0.049164 -0.456843 -0.408361 -0.411097 -0.404168 -0.386247 -0.361551 -0.390861 -0.083042 -0.686878 -0.689933 0.168597 0.204551 0.206727 0.184534 0.196832 0.198261 0.192063 0.191251 0.197046 0.197209 0.191732 0.217650 0.186076 0.205088 0.232876 0.211308 0.220117 0.219480 0.215897 0.241452 0.184817 0.231963 0.322163
chargesum: 0.00000
title: Mulliken charges with hydrogens summed into heavy atoms:
elementType: O N C C C C C C C C C C C
charge: -0.114080 -0.151631 0.217761 -0.045565 -0.026995 -0.020773 -0.015872 0.002695 0.042175 0.047104 0.128266 -0.031384 -0.031701
polarizability: 1.45410831e+02 -1.21384194e+00 1.30596046e+02 1.36631381e+00 2.13916855e+00 1.07352340e+02
1716.lowfreq: -11.3368 -0.0003 0.0004 0.0004 9.5411 12.5461 37.4090 56.7534 62.1144
frequency: 37.3408 56.6243 62.0200 88.2359 135.6558 162.3103 185.4288 221.1180 236.1737 248.7682 267.8346 281.4070 297.6271 315.7956 346.5673 386.7275 409.6668 428.1255 432.0793 440.1152 485.8826 510.2979 568.9260 761.1759 778.6579 785.1660 809.3592 815.6963 848.9869 878.0680 889.4741 902.3298 913.1797 924.3202 935.0975 983.8488 1018.9543 1040.9676 1047.5661 1055.4920 1058.9576 1076.6054 1091.4977 1112.0302 1127.3368 1139.6483 1153.1237 1175.2764 1205.5280 1234.1090 1248.1404 1255.7649 1258.7934 1266.0092 1300.6299 1312.0234 1316.9812 1327.9887 1333.4895 1338.0284 1340.7239 1341.2573 1349.4791 1361.3906 1365.5978 1370.4119 1376.6794 1382.4798 1457.7971 1460.4217 1462.1563 1463.9968 1468.3376 1469.7172 1474.4419 1474.6115 1480.0422 1482.3764 1491.7159 2818.2618 2928.9734 2964.0913 2964.6859 2967.3521 2967.5943 2971.6063 2978.6652 2979.9120 2997.8178 3020.8216 3026.0134 3026.6651 3036.4154 3040.3268 3045.0421 3046.2191 3049.5660 3071.7954 3072.7558 3080.6979 3097.1673 3544.7404
redmass: 3.0400 2.9136 3.8131 2.9136 2.7893 2.7043 1.1585 2.1567 2.1863 1.4831 1.7672 1.4450 1.8455 1.9285 2.5336 2.3206 2.4911 2.6596 2.2803 2.7674 1.6283 2.6567 2.4993 2.2953 1.2234 1.4425 2.7326 3.0168 1.9726 1.6384 1.4501 1.8292 1.9551 2.3545 2.2369 2.3737 1.5645 1.8186 2.3078 1.3772 1.8520 1.3866 1.9567 2.3512 2.3043 2.1787 1.9899 1.8413 1.7939 1.4404 1.4760 1.2797 1.2301 1.2470 1.1851 1.3282 1.2709 1.3531 1.4289 1.4185 1.4786 1.4829 1.3170 1.3492 1.2204 1.4153 1.2149 1.2729 1.0751 1.0772 1.0870 1.0809 1.0642 1.0705 1.0599 1.0673 1.0626 1.0682 1.0808 1.0806 1.0662 1.0630 1.0620 1.0411 1.0634 1.0620 1.0364 1.0608 1.0629 1.0905 1.0972 1.0953 1.1004 1.0986 1.0915 1.0989 1.0995 1.0962 1.0962 1.1008 1.1001 1.0658
irintensity: 0.3957 0.6831 2.4977 0.1606 0.0294 0.6130 0.5723 2.6057 1.2654 11.6976 6.9515 26.5780 78.1736 3.6146 4.5612 11.6939 14.1746 1.9028 1.8787 3.1382 1.7491 8.0439 2.2375 5.9376 12.7885 0.6264 1.8073 17.1451 7.6081 2.8169 11.4376 2.7660 9.9799 1.5675 7.9158 4.4820 92.2486 5.0108 48.3553 11.0644 7.9920 10.9560 42.1726 0.2041 13.9425 16.9270 23.2310 7.4689 6.8846 3.9929 5.4562 4.3103 1.3946 3.7033 3.8713 0.2902 3.3079 7.2398 1.5807 10.0672 0.2254 2.2211 6.6302 5.3371 29.2981 13.7773 5.3943 51.9153 6.4361 8.4687 11.5833 2.7506 27.0758 6.5107 3.2042 11.7804 3.4987 9.3519 9.2861 74.0022 58.3227 36.5982 42.1023 22.5150 31.0293 17.5971 21.4172 46.7735 37.3713 4.2796 73.8330 72.3253 33.1283 3.5309 50.9785 47.9596 57.7972 6.1974 113.6923 61.9219 25.7368 4.8497
temp: 298.150 k
press: 1.00000 atm
elementType: 8 7 6 6 6 6 6 6 6 6 6 6 6 1 1 1 1 1 1 1 1 1 1 1 1 1 1 1 1 1 1 1 1 1 1 1
symmnumber: 1
zpe: 855903.3 jmol-1
zpe.correction: 0.325996 hartree
zpe.thermalcorrener: 0.341078 hartree
zpe.thermalcorrenthalpy: 0.342022 hartree
zpe.thermalcorrgfe: 0.284202 hartree
zpe.sumelectzpe: -561.830048 hartree
zpe.sumelectthermal: -561.814967 hartree
zpe.sumelectthermalent: -561.814023 hartree
zpe.sumelectthermalfe: -561.871843 hartree
dipole: 2.2525 -0.4033 -0.3581
dipole: 2.3161
quadrupole: -95.0520 -78.7599 -81.9448
quadrupole: 2.1968 -0.2401 2.8449
quadrupole: -9.7998 6.4924 3.3074 2.1968 -0.2401 2.8449
hfenergy: -562.1560446 hartree
pointgroup: C01 [X(C11H23N1O1)]
dipole: 0.8885786 0.1863462 0.0778743 debye
polarizability: 145.3075454|0.7667036|130.3062509|-2.5586434|-3.3651148|107.7454203 unknown
InChI: InChI=1S/C11H23NO/c1-3-12(9-10(2)13)11-7-5-4-6-8-11/h10-11,13H,3-9H2,1-2H3
charge 0 multiplicity 1
36 atoms
O  -4.082282 0.829166 0.543997
N  -0.634336 -0.644862 -0.084882
C  0.749505 -0.188583 0.265799
C  1.838991 -1.056628 -0.416521
C  0.964251 1.289296 -0.165131
C  3.264928 -0.562748 -0.069867
C  2.379656 1.802179 0.190575
C  3.472764 0.919766 -0.453042
C  -1.731948 0.052436 0.632925
C  -0.860221 -2.115022 -0.136742
C  -2.932795 0.396568 -0.287924
C  -0.664405 -2.898218 1.192746
C  -2.596653 1.432799 -1.36834
H  0.922305 -0.247874 1.374021
H  1.683206 -1.015378 -1.514347
H  1.747275 -2.115548 -0.113237
H  0.209715 1.95023 0.300771
H  0.805483 1.34629 -1.261072
H  4.010757 -1.201475 -0.581781
H  3.437081 -0.683769 1.020103
H  2.508323 1.797901 1.293277
H  2.488716 2.853921 -0.138336
H  4.4794 1.260334 -0.141577
H  3.42326 1.023474 -1.556694
H  -2.133218 -0.548912 1.479245
H  -1.35251 0.993493 1.074399
H  -1.897684 -2.27214 -0.488866
H  -0.210043 -2.548852 -0.916834
H  -3.306743 -0.528577 -0.760927
H  0.374973 -2.824905 1.561082
H  -1.333656 -2.524659 1.988868
H  -0.894065 -3.969246 1.038412
H  -1.754924 1.069759 -1.983505
H  -2.293486 2.397157 -0.911788
H  -3.469997 1.614822 -2.018518
H  -3.885524 1.734406 0.898111
