program: Gaussian 09
title: 000275827
version: EM64L-G09RevD.01
frameworkgroup: C1[X(C24H19ClO4S)]
method: RPBEPBE
basis: SDD
operation: Freq
keyword: #p
keyword: freq=noraman
keyword: PBEPBE/SDD
title: #p freq=noraman PBEPBE/SDD
converged: YES YES NO NO
title: Mulliken charges:
elementType: Cl S O O O O C C C C C C C C C C C C C C C C C C C C C C C C H H H H H H H H H H H H H H H H H H H
charge: -0.000973 0.891394 -0.253926 -0.546436 -0.512399 -0.240215 -0.542214 -0.420664 -0.558493 -0.136351 0.506634 0.381838 0.390143 0.308320 -0.412497 -0.444671 -0.447479 -0.004932 -0.370495 -0.225905 -0.220830 -0.232538 -0.257904 -0.259430 -0.276320 0.307683 -0.209816 -0.210122 -0.760684 -0.216290 0.337767 0.347912 0.303887 0.254641 0.246791 0.246281 0.260665 0.226859 0.227644 0.232975 0.233720 0.292270 0.288593 0.241849 0.240691 0.254717 0.246914 0.254332 0.237059
chargesum: 0.00000
title: Mulliken charges with hydrogens summed into heavy atoms:
elementType: Cl S O O O O C C C C C C C C C C C C C C C C C C C C C C C C
charge: -0.000973 0.891394 -0.253926 -0.546436 -0.512399 -0.240215 -0.204447 -0.420664 -0.210582 0.167536 0.506634 0.381838 0.390143 0.308320 -0.157856 -0.197880 -0.201198 -0.004932 -0.109830 0.000955 0.006815 0.000437 -0.024184 0.032840 0.012273 0.307683 0.032033 0.030569 -0.004720 0.020769
polarizability: 3.08071876e+02 -2.77778951e+01 2.94755030e+02 -5.62072281e+00 -1.48023215e+01 2.93249644e+02
1716.lowfreq: -6.2052 0.0003 0.0015 0.0018 2.2305 6.7816 20.0812 26.0927 32.1797
frequency: 18.9679 26.0432 32.1381 42.4616 48.1582 52.1407 57.8888 69.2090 76.3325 104.8174 107.7570 133.8609 143.6222 152.9217 159.8231 168.0214 182.7560 200.9613 217.1770 237.4127 246.4629 262.4715 278.8488 321.3881 330.5001 344.4082 368.3744 385.4917 404.2928 409.4439 424.5845 445.6614 448.5998 486.6186 494.3402 511.9827 537.3137 550.0814 553.8398 588.4872 603.4040 606.4121 610.4536 624.5818 650.8779 657.2847 690.3430 706.1392 723.0614 738.0088 757.6112 760.6595 767.6055 782.8692 791.3566 804.7857 835.8208 851.7594 857.3769 864.7705 882.9592 891.3269 916.2822 923.7085 934.9916 943.2045 954.7102 959.0613 977.1080 981.1285 983.7731 990.4068 992.0964 994.2427 1004.1289 1008.2423 1017.4384 1027.8658 1040.5100 1044.9580 1050.4026 1059.8720 1076.9004 1080.6007 1105.3784 1153.7952 1168.5197 1173.2594 1176.3241 1178.0977 1179.7957 1184.8551 1187.2354 1199.2519 1204.7175 1227.9422 1243.3013 1267.4014 1287.6007 1297.3850 1303.9869 1312.8358 1319.0033 1380.8160 1383.4900 1383.8031 1397.8948 1436.5761 1441.4213 1451.3617 1451.9505 1453.4198 1453.4673 1462.1091 1479.9055 1577.9278 1586.8616 1602.5372 1604.1490 1611.7432 1622.8516 1654.3627 3007.3389 3008.7633 3058.8657 3089.3720 3098.9550 3127.4715 3130.5411 3136.3496 3136.8192 3142.5464 3143.1849 3146.8738 3148.8510 3156.3600 3156.4743 3166.0206 3166.2231 3169.8466 3175.0200
redmass: 5.4398 7.2317 5.4030 3.5623 1.8475 4.9244 5.4916 2.6726 3.0900 4.4150 6.6409 5.2430 6.6136 6.8402 11.2361 9.0648 6.1220 9.5111 5.7104 7.4558 8.8239 6.6879 5.5966 4.9756 6.4351 7.4050 9.3514 5.6847 2.8204 3.5125 5.5481 3.7385 4.8321 4.7724 4.3073 4.1700 4.3624 5.7125 3.3037 4.8547 6.4700 5.3633 5.3185 6.1734 5.9805 6.9544 2.3684 4.2507 4.7194 3.0332 1.6291 1.4687 2.0324 2.7862 4.5086 4.8760 3.7098 1.2760 4.1820 2.7251 1.6724 1.8242 4.4032 10.1906 1.3772 6.6312 1.4795 1.4694 3.6274 2.6955 1.5795 1.4914 1.7292 1.3569 1.3382 4.2419 2.5312 3.0718 1.7012 2.6736 2.1068 3.4029 1.6311 2.5963 2.3391 1.6694 1.2595 1.0601 1.2405 1.1248 1.2293 1.9596 1.9235 1.7644 1.7283 1.5134 2.4914 1.8346 1.5859 1.5078 1.2996 1.4227 1.2447 6.4280 1.2745 8.3321 6.2740 2.2566 2.3584 2.2354 1.1050 1.1281 1.8104 2.7531 2.4859 5.8301 6.8332 7.0332 6.9609 6.4817 7.4375 9.6151 1.0377 1.0830 1.0868 1.0884 1.0953 1.0862 1.0857 1.0857 1.0891 1.0905 1.1020 1.0886 1.0946 1.0930 1.0953 1.0967 1.1006 1.0997 1.1010
irintensity: 1.6287 1.3246 0.4711 1.9832 0.7995 1.0114 0.9282 0.3361 1.2484 0.8750 1.4732 0.8728 1.7105 0.0319 3.9897 1.0928 6.6359 5.7226 7.4242 1.7352 7.0369 1.5617 1.6355 6.1077 3.2758 1.0063 17.0683 5.9494 0.1736 0.8480 37.5951 9.8813 37.1065 29.9926 80.9016 4.2546 24.8653 10.5474 1.6189 8.2931 0.2208 4.6917 11.7810 8.4730 7.1156 5.3231 33.8493 8.6182 2.1067 25.8762 37.7397 76.3444 40.5197 29.4720 24.0116 24.7092 14.2113 0.4946 4.5479 6.6460 9.0394 3.8275 8.0325 69.9614 3.4565 90.1060 0.3705 1.8239 11.0010 4.9561 0.9296 38.6329 77.5577 5.8488 0.1318 2.0780 7.2921 15.4526 5.2343 22.9335 25.7871 0.9386 8.2550 7.9443 2.9321 0.5232 6.2431 0.6869 27.2834 15.2874 7.5812 7.3456 227.1432 45.0003 77.9290 12.0272 0.6926 4.1825 16.9236 12.9795 3.1557 8.8405 14.3374 1.2096 59.1471 4.9223 2.2064 15.1503 10.1215 13.4956 18.8464 24.3827 12.2350 6.7420 19.9735 5.2030 1.0731 0.7457 0.6398 3.7495 1.9937 166.5449 1.5139 14.4096 4.7106 4.4683 5.3220 1.4102 0.5289 1.1421 2.9932 9.3450 10.2364 9.0381 15.4670 4.1368 20.5942 5.6962 31.9009 21.4628 29.9228
temp: 298.150 k
press: 1.00000 atm
elementType: 17 16 8 8 8 8 6 6 6 6 6 6 6 6 6 6 6 6 6 6 6 6 6 6 6 6 6 6 6 6 1 1 1 1 1 1 1 1 1 1 1 1 1 1 1 1 1 1 1
symmnumber: 1
zpe: 957132.0 jmol-1
zpe.correction: 0.364552 hartree
zpe.thermalcorrener: 0.391282 hartree
zpe.thermalcorrenthalpy: 0.392227 hartree
zpe.thermalcorrgfe: 0.305351 hartree
zpe.sumelectzpe: -2082.722603 hartree
zpe.sumelectthermal: -2082.695873 hartree
zpe.sumelectthermalent: -2082.694929 hartree
zpe.sumelectthermalfe: -2082.781805 hartree
dipole: 2.1659 1.9744 2.4668
dipole: 3.8308
quadrupole: -164.5942 -190.8999 -176.0191
quadrupole: -18.8219 -13.3576 -11.5856
quadrupole: 12.5769 -13.7288 1.1519 -18.8219 -13.3576 -11.5856
hfenergy: -2083.0871552 hartree
pointgroup: C01 [X(C24H19Cl1O4S1)]
dipole: -0.829675 1.2060892 0.3584146 debye
polarizability: 298.6875556|12.4368411|284.6669311|23.6657339|-13.3172305|312.7220633 unknown
InChI: InChI=1S/C24H19ClO4S/c1-15(26)29-22-18-12-6-5-11-17(18)21-19-13-7-8-14-20(19)24(22,25)23(21)30(27,28)16-9-3-2-4-10-16/h2-14,21-23H,1H3
charge 0 multiplicity 1
49 atoms
Cl 0.031891 -1.125392 1.959711
S  2.445008 -0.874827 -0.606949
O  -2.696591 0.157966 0.923316
O  3.091989 -0.400479 -2.041489
O  2.180728 -2.450886 -0.289587
O  -2.872712 1.610171 2.750098
C  0.787797 0.249124 -0.475378
C  -0.39615 -0.38755 0.26656
C  0.212513 0.37153 -1.905525
C  -1.399748 0.777795 0.533754
C  -0.913621 -1.406372 -0.737924
C  -0.539765 -0.962906 -2.03171
C  -0.794809 1.526616 -1.855116
C  -1.588635 1.687715 -0.684094
C  -1.67097 -2.571011 -0.555492
C  -0.918302 -1.684045 -3.174265
C  -0.963893 2.412803 -2.941777
C  3.585599 -0.1811 0.744437
C  -2.5404 2.73136 -0.622784
C  -2.043576 -3.310047 -1.70489
C  -1.670489 -2.872567 -2.999505
C  -1.924332 3.446524 -2.879769
C  -2.713755 3.605901 -1.71681
C  3.634535 -0.847038 1.978547
C  4.37954 0.929524 0.41508
C  -3.301771 0.629501 2.104637
C  4.526577 -0.344782 2.954807
C  5.261596 1.419009 1.40706
C  -4.504296 -0.220436 2.439601
C  5.329169 0.785972 2.671193
H  1.183186 1.177537 -0.031797
H  0.997513 0.525688 -2.664219
H  -1.051037 1.374795 1.39918
H  -1.939697 -2.910883 0.448925
H  -0.625838 -1.350786 -4.175716
H  -0.342966 2.290519 -3.836708
H  -3.137296 2.865177 0.285935
H  -2.618085 -4.23607 -1.592941
H  -1.958889 -3.465748 -3.874396
H  -2.051457 4.127274 -3.7285
H  -3.45292 4.41204 -1.659858
H  3.011456 -1.728835 2.156516
H  4.332817 1.366587 -0.588001
H  4.595034 -0.837633 3.930126
H  5.898296 2.282704 1.188685
H  -5.08813 -0.440955 1.531385
H  -5.128161 0.292154 3.185993
H  -4.163748 -1.185045 2.857846
H  6.017494 1.167805 3.433105
