program: Gaussian 09
title: 000275794
version: EM64L-G09RevD.01
frameworkgroup: C1[X(C16H15NO2)]
method: RPBEPBE
basis: SDD
operation: Freq
keyword: #p
keyword: freq=noraman
keyword: PBEPBE/SDD
title: #p freq=noraman PBEPBE/SDD
converged: YES YES NO NO
title: Mulliken charges:
elementType: O O N C C C C C C C C C C C C C C C C H H H H H H H H H H H H H H H
charge: -0.198835 -0.272127 -0.363784 0.191838 0.150138 -0.023003 0.295966 -0.363080 0.127612 -0.373340 -0.240897 -0.348390 -0.228934 -0.363094 -0.362809 -0.645208 -0.236892 -0.228877 -0.228091 0.264864 0.276510 0.309534 0.210056 0.257097 0.236860 0.237325 0.267011 0.278128 0.211444 0.201922 0.254190 0.234369 0.236249 0.236246
chargesum: 0.00000
title: Mulliken charges with hydrogens summed into heavy atoms:
elementType: O O N C C C C C C C C C C C C C C C C
charge: -0.198835 -0.272127 -0.054250 0.191838 0.150138 -0.023003 0.295966 -0.098216 0.127612 -0.096830 -0.004037 0.118763 0.008391 -0.096083 -0.084681 0.022349 -0.002523 0.007372 0.008155
polarizability: 2.38298222e+02 -1.86293931e+01 1.99168613e+02 -6.12862831e+00 -1.55938662e+01 1.23332971e+02
1716.lowfreq: -6.8988 -4.4976 -0.0007 -0.0007 0.0003 4.5481 19.0148 22.7340 49.5787
frequency: 18.9450 22.7019 49.5355 52.5296 65.4733 81.6261 115.6078 141.5609 163.6737 190.1799 212.5178 236.1206 272.4593 316.6433 320.2463 346.4205 380.9418 405.1390 431.3126 446.7067 450.3723 526.3371 569.6605 579.7776 613.2682 630.0952 650.3402 674.4411 695.6309 708.8509 717.4943 760.4559 771.1471 786.1692 808.0676 846.7065 865.0636 888.7860 899.8695 915.7808 951.2974 971.4761 988.9227 994.0539 1000.6014 1008.8540 1024.1188 1025.0263 1050.8265 1081.5393 1084.4550 1099.1188 1141.0615 1153.0498 1160.8700 1174.9818 1178.1869 1188.2001 1256.9160 1267.4676 1278.4518 1285.7319 1318.1294 1351.8367 1369.7708 1385.8520 1389.7718 1422.3746 1433.9305 1462.5291 1466.5096 1469.1742 1475.8005 1479.7290 1498.3968 1539.7693 1567.7009 1586.9392 1590.7456 1603.6310 1607.4617 2983.9719 2998.1567 3067.6902 3085.8371 3104.1181 3129.8934 3132.3206 3139.1871 3144.3586 3149.9978 3157.9119 3159.2326 3169.9107 3170.8465 3547.8201
redmass: 3.1013 4.7400 4.2110 4.0246 3.9734 4.9094 4.2002 5.1870 5.3456 2.4849 2.1338 2.9440 3.4142 5.7380 3.6597 4.9421 4.4464 2.8542 4.5390 3.1721 3.7894 3.6286 1.8951 2.3734 6.4335 6.2544 5.6861 5.6068 3.3017 1.6921 4.3707 1.8020 1.8409 1.9505 2.7298 2.4009 1.2469 1.8544 1.7029 4.7359 1.4370 1.4022 6.1770 1.3806 1.3478 1.3373 3.8027 2.2417 2.4530 2.2607 1.6909 2.0891 1.7024 2.2477 2.8147 1.0626 1.0684 1.1403 1.7761 4.0338 1.4171 1.3809 1.3471 1.3175 10.4629 8.9465 1.2099 2.0761 2.2668 1.2908 1.5964 1.1287 2.2227 1.0848 1.9051 9.1696 6.6990 6.2580 6.6883 6.3569 6.1654 1.0363 1.0650 1.0988 1.0980 1.1013 1.0852 1.0856 1.0881 1.0902 1.0924 1.0948 1.0961 1.1013 1.1001 1.0775
irintensity: 0.7392 0.9200 0.7622 4.8098 2.9685 2.4600 1.8017 3.2034 0.8912 0.9531 1.9531 3.2047 0.9489 1.9119 10.5276 9.5587 3.7504 0.0827 1.1703 0.3926 4.9940 3.6225 46.9986 51.6598 0.2077 25.5723 10.2773 1.1212 2.7455 116.8410 6.1314 4.6585 30.8427 27.7437 18.5082 12.1885 1.7423 3.3313 9.9191 45.7848 3.4548 1.4112 1.8366 1.7298 1.5423 1.0865 3.6021 3.0049 2.5274 10.8461 6.4216 12.8527 5.6340 14.4257 19.1458 0.4411 0.7179 18.8598 43.0059 272.4800 1.5457 99.9841 9.2710 3.3276 16.1462 2.8191 16.5505 3.0339 16.0876 37.6714 19.6397 10.5096 2.2119 22.9552 165.0518 134.5285 68.7528 44.1864 65.9889 15.4655 23.3891 24.2019 55.3105 15.8537 38.3023 25.7264 0.3277 0.3829 5.6897 13.9960 11.5748 9.7851 16.0498 28.1055 17.4791 13.0223
temp: 298.150 k
press: 1.00000 atm
elementType: 8 8 7 6 6 6 6 6 6 6 6 6 6 6 6 6 6 6 6 1 1 1 1 1 1 1 1 1 1 1 1 1 1 1
symmnumber: 1
zpe: 706724.9 jmol-1
zpe.correction: 0.269177 hartree
zpe.thermalcorrener: 0.286459 hartree
zpe.thermalcorrenthalpy: 0.287403 hartree
zpe.thermalcorrgfe: 0.221498 hartree
zpe.sumelectzpe: -822.572571 hartree
zpe.sumelectthermal: -822.555290 hartree
zpe.sumelectthermalent: -822.554346 hartree
zpe.sumelectthermalfe: -822.620251 hartree
dipole: -5.2116 -1.7610 3.4865
dipole: 6.5129
quadrupole: -109.9110 -96.6016 -112.7430
quadrupole: -5.3617 4.3196 1.3051
quadrupole: -3.4924 9.8169 -6.3245 -5.3617 4.3196 1.3051
hfenergy: -822.8417488 hartree
pointgroup: C01 [X(C16H15N1O2)]
dipole: -1.7655697 1.2054111 -1.4126226 debye
polarizability: 244.8133387|-2.7711747|185.4915245|-10.362827|-25.7004381|130.4949422 unknown
InChI: InChI=1S/C16H15NO2/c1-2-17-16(19)14-11-7-6-10-13(14)15(18)12-8-4-3-5-9-12/h3-11,17H,2H2,1H3
charge 0 multiplicity 1
34 atoms
O  -0.175319 -0.721103 1.603723
O  3.197869 -2.185249 0.209818
N  1.069208 -2.319841 -0.727996
C  0.92813 0.691135 -0.012745
C  2.076622 -0.101821 -0.32076
C  -0.297827 0.114353 0.655019
C  -1.664107 0.559401 0.208309
C  1.000225 2.103076 -0.172162
C  2.147988 -1.615361 -0.226341
C  3.265304 0.53938 -0.746962
C  2.186867 2.727083 -0.608344
C  0.962625 -3.784632 -0.603763
C  3.326956 1.941009 -0.892808
C  -1.900701 1.128924 -1.073131
C  -2.763162 0.33389 1.082141
C  -0.025062 -4.212096 0.503744
C  -3.212727 1.470254 -1.4682
C  -4.06904 0.686686 0.691206
C  -4.297345 1.255881 -0.586307
H  0.131544 2.715647 0.09171
H  4.140381 -0.086894 -0.946972
H  0.248729 -1.806851 -1.054703
H  0.659924 -4.207525 -1.580923
H  1.978642 -4.147845 -0.373928
H  2.22583 3.817133 -0.707729
H  4.257253 2.416259 -1.221972
H  -1.065047 1.289373 -1.762598
H  -2.563612 -0.122306 2.057517
H  -0.049238 -5.314467 0.58523
H  -1.051665 -3.860997 0.290286
H  0.282614 -3.790927 1.475518
H  -3.389939 1.899841 -2.46017
H  -4.909318 0.519331 1.37362
H  -5.3141 1.526457 -0.892428
