program: Gaussian 09
title: 000275786
version: EM64L-G09RevD.01
frameworkgroup: C1[X(C10H11NO4)]
method: RPBEPBE
basis: SDD
operation: Freq
keyword: #p
keyword: freq=noraman
keyword: PBEPBE/SDD
title: #p freq=noraman PBEPBE/SDD
converged: YES YES NO NO
title: Mulliken charges:
elementType: O O O O N C C C C C C C C C C H H H H H H H H H H H
charge: -0.237327 -0.384659 -0.228218 -0.242214 0.097130 0.246592 0.543168 -0.519805 0.136260 -0.387953 -0.349882 -0.247153 -0.272850 -0.680311 -0.208344 0.259735 0.232289 0.227100 0.212958 0.213093 0.275498 0.209829 0.235960 0.235908 0.269681 0.363515
chargesum: 0.00000
title: Mulliken charges with hydrogens summed into heavy atoms:
elementType: O O O O N C C C C C C C C C C
charge: -0.237327 -0.021144 -0.228218 -0.242214 0.097130 0.246592 0.543168 -0.260071 0.136260 -0.155664 -0.122782 0.178898 0.002648 0.001387 0.061337
polarizability: 2.86064174e+02 1.96737346e+01 1.55663369e+02 -2.62399992e-02 4.67515159e-02 6.08637183e+01
1716.lowfreq: -9.8811 -2.1928 -0.0006 -0.0004 0.0005 3.3146 35.6214 65.7916 67.4137
frequency: 35.5876 65.7897 67.3844 68.9844 111.4163 136.8405 148.9591 172.3113 231.9659 237.8935 261.4471 276.0679 311.2605 349.6752 372.2573 398.3931 457.1039 484.9802 528.0052 555.1432 587.1066 596.1613 669.3369 675.7323 740.4694 760.7128 788.2292 799.4803 824.3968 841.8424 868.5829 873.1187 922.5402 941.6104 972.8164 1002.7058 1029.6827 1083.8788 1116.7529 1133.5252 1166.8448 1187.5042 1205.1621 1220.5959 1261.5973 1262.7268 1279.0498 1304.4589 1315.0666 1366.2487 1374.6715 1399.2426 1402.6658 1426.5468 1460.0810 1475.7466 1487.2435 1518.4774 1589.2028 1604.3534 1631.1882 2956.9922 2999.9548 3017.8449 3097.5373 3110.2225 3115.0847 3120.5378 3155.7724 3163.6411 3202.4253 3568.1946
redmass: 6.8367 6.2024 3.9797 5.6739 1.7402 4.4783 4.4502 3.8597 9.3367 1.2110 4.9468 3.9369 4.8668 4.8146 3.6546 1.1365 3.1475 5.2302 7.1230 4.1761 7.2170 3.5500 9.5379 6.1242 3.0223 5.3887 5.8696 1.4938 1.1520 1.6709 3.4827 1.5593 1.3728 5.3797 3.3076 1.2561 2.5928 2.1327 2.1956 1.4321 1.1921 1.8592 3.6420 2.0081 1.1458 1.9555 1.9250 2.5119 1.6367 1.4127 4.1002 1.5866 2.3232 6.1221 1.0394 1.0714 1.0815 3.0766 6.0461 6.0607 5.7819 1.0552 1.0363 1.1078 1.0989 1.1015 1.0889 1.0894 1.0909 1.0950 1.0948 1.0661
irintensity: 0.0478 1.7260 3.6718 3.1227 3.8688 2.4140 3.1943 0.0014 0.1922 1.6235 1.5709 0.9700 2.8771 8.8146 0.0095 140.6116 0.1608 1.6145 17.7481 6.0203 14.6870 15.2414 1.4382 1.9927 0.1553 9.2291 12.6787 36.2534 26.4541 33.6973 13.1882 4.6115 0.3824 32.2789 32.1236 48.9779 65.7205 283.4493 17.6444 5.1648 17.6845 44.7079 812.4397 277.3214 0.1239 42.8857 117.9858 63.8551 34.8882 0.8131 160.3306 11.1279 60.7068 28.1760 12.4552 19.3002 16.7067 126.9773 92.8246 214.3786 146.5679 28.1578 22.6920 33.4612 22.5248 30.9108 0.0226 16.4035 9.0587 3.3774 8.9913 94.8732
temp: 298.150 k
press: 1.00000 atm
elementType: 8 8 8 8 7 6 6 6 6 6 6 6 6 6 6 1 1 1 1 1 1 1 1 1 1 1
symmnumber: 1
zpe: 514077.4 jmol-1
zpe.correction: 0.195802 hartree
zpe.thermalcorrener: 0.210424 hartree
zpe.thermalcorrenthalpy: 0.211369 hartree
zpe.thermalcorrgfe: 0.153009 hartree
zpe.sumelectzpe: -742.087180 hartree
zpe.sumelectthermal: -742.072557 hartree
zpe.sumelectthermalent: -742.071613 hartree
zpe.sumelectthermalfe: -742.129973 hartree
dipole: 6.7021 2.4827 0.0037
dipole: 7.1472
quadrupole: -124.9187 -68.4529 -89.6263
quadrupole: -10.6248 0.0117 0.0204
quadrupole: -30.5861 25.8798 4.7063 -10.6248 0.0117 0.0204
hfenergy: -742.2829817 hartree
pointgroup: C01 [X(C10H11N1O4)]
dipole: -2.6182728 -1.0254543 -0.0050851 debye
dipolederiv: -1.2612419 0.7268192 0.0430627 1.039571 -1.0119993 -0.0447401 0.0558725 -0.0408633 -0.2626808 -1.5204809 -0.789759 -0.0166776 -0.8299256 -0.4608901 0.0075497 -0.0176796 0.0072157 -0.3756635 -1.2747933 0.0579518 0.0161879 0.1786332 -0.4671641 -0.0111593 0.021237 -0.009465 -0.2551874 -0.5301926 -0.0266056 0.0027763 -0.528583 -0.9704876 -0.0226651 -0.0177426 -0.0293937 -0.245407 2.2498603 0.2839989 -0.0162548 0.9539554 1.348426 0.034654 0.0109917 0.0435775 0.1914575 1.0453015 -0.889071 -0.0488778 -1.3285587 0.1775064 0.0208555 -0.0659632 0.015136 0.0996512 -0.7120274 -0.3877715 -0.0059782 -0.5626376 -0.20811 -0.0013646 -0.0133036 -0.0037402 0.0120395 0.1597431 0.425886 0.0124651 -0.1708241 -0.0009691 0.0104385 -0.0118438 0.0025109 -0.2134277 1.3784476 0.7913284 0.0143683 0.9047819 0.3417736 -0.0001206 0.018409 0.0011058 0.0443558 0.1414565 0.1972843 0.0044519 0.4017933 0.1565251 0.0064642 0.012832 0.0093484 -0.1391229 -0.6010594 -0.3328877 -0.0076522 0.2127884 0.1274495 0.0087796 0.0140403 0.0159231 -0.1669215 0.3534256 -0.1226132 -0.0044184 -0.6607911 0.9084085 0.0299782 -0.0267274 0.0229469 0.3937449 1.5229462 0.5039319 -0.0005179 0.2117357 0.1166015 0.0038209 -0.0122147 -0.0000807 -0.0453664 -0.0810193 0.0800054 0.0055208 0.1335746 -0.0033446 -0.0041658 0.0076575 -0.0034271 0.0503261 -1.6332751 -0.5853017 -0.0040428 -0.2226547 -0.0169259 0.0088223 0.0103007 0.0135365 -0.1568628 0.1194174 -0.0283436 -0.0006869 0.0291209 -0.0563666 -0.0089001 0.001623 -0.0081803 0.1606085 -0.0227914 0.0940542 0.0059643 0.0587258 0.0449972 -0.0050809 0.0045012 -0.0055431 0.1532581 0.0398051 -0.0622162 -0.0007663 -0.0574227 -0.1113605 -0.0103758 -0.0006456 -0.010201 0.1686212 -0.0158638 -0.0670758 -0.1149174 0.0921466 -0.0546024 -0.0257947 -0.0873137 -0.062167 -0.083751 -0.0091272 -0.0740343 0.106822 0.0858655 -0.0624949 0.0257841 0.0923699 0.0666447 -0.0830003 0.1043608 0.0220636 0.0016083 0.0072229 0.0078532 -0.0063257 0.001338 -0.0063642 0.160097 0.0524348 0.0031351 0.0011237 0.0621366 -0.158628 -0.012196 0.0036257 -0.0113441 0.1163201 0.0263198 -0.0021609 -0.071322 -0.0775298 0.1004127 -0.0677082 -0.0982034 -0.047295 -0.0570259 0.0317897 -0.0061288 0.0681647 -0.0826388 0.0897753 0.0825627 0.0888421 0.0597678 -0.0520239 0.0709919 -0.0076993 0.0014802 -0.0614313 -0.0092388 -0.0078892 -0.0006771 -0.0085966 0.2026055 0.3655718 0.1952098 0.0081161 0.2109457 0.1728529 -0.0112236 0.0086741 -0.011052 0.3833557 unknown
polarizability: 285.261212|22.1456222|156.2940069|-2.1053305|3.5643955|61.036043 unknown
InChI: InChI=1S/C10H11NO4/c1-2-15-10-7-8(3-4-9(10)12)5-6-11(13)14/h3-7,12H,2H2,1H3
charge 0 multiplicity 1
26 atoms
O  -3.185797 0.463759 0.145812
O  -3.311864 -2.198662 0.040615
O  5.355786 0.056842 0.015903
O  4.071091 1.953432 0.111068
N  4.206999 0.664196 0.056387
C  -1.965348 -0.202992 0.102445
C  0.506585 -0.357996 0.064212
C  -0.697379 0.410274 0.110225
C  -2.038793 -1.632019 0.046275
C  0.409845 -1.776171 0.008922
C  -0.850138 -2.398159 0.000318
C  -3.160763 1.943126 0.207004
C  1.776849 0.358747 0.076607
C  -4.614816 2.401563 0.250471
C  3.029427 -0.186712 0.037506
H  -0.618195 1.501114 0.151965
H  1.311948 -2.394117 -0.027091
H  -0.920527 -3.492763 -0.041969
H  -2.607324 2.26178 1.11415
H  -2.637632 2.337052 -0.688452
H  1.739155 1.456382 0.121984
H  -4.662076 3.50463 0.29655
H  -5.15624 2.063908 -0.649173
H  -5.12599 1.990555 1.137187
H  3.284256 -1.245854 -0.009458
H  -3.257257 -3.186814 0.000335
