program: Gaussian 09
title: 000277714
version: EM64L-G09RevD.01
frameworkgroup: C1[X(C19H17O4P)]
method: RPBEPBE
basis: SDD
operation: Freq
keyword: #p
keyword: freq=noraman
keyword: PBEPBE/SDD
title: #p freq=noraman PBEPBE/SDD
converged: YES YES NO NO
title: Mulliken charges:
elementType: P O O O O C C C C C C C C C C C C C C C C C C C H H H H H H H H H H H H H H H H H
charge: 1.166563 -0.533347 -0.595991 -0.388290 -0.585135 -0.602218 0.572776 -0.421432 -0.344945 0.350888 0.421185 -0.210915 -0.226722 -0.231750 -0.331423 -0.346249 -0.373778 -0.380642 -0.202899 -0.197791 -0.193618 -0.191316 -0.249213 -0.244779 0.307290 0.231364 0.257023 0.382512 0.232408 0.231352 0.233666 0.292273 0.280697 0.258535 0.252694 0.228759 0.231047 0.229998 0.231075 0.229118 0.231228
chargesum: 0.00000
title: Mulliken charges with hydrogens summed into heavy atoms:
elementType: P O O O O C C C C C C C C C C C C C C C C C C C
charge: 1.166563 -0.533347 -0.595991 -0.005777 -0.585135 -0.294929 0.572776 -0.190068 -0.087922 0.350888 0.421185 0.021493 0.004630 0.001916 -0.039150 -0.065552 -0.115242 -0.127948 0.025860 0.033256 0.036381 0.039759 -0.020095 -0.013551
polarizability: 2.70044999e+02 -8.01749224e+00 2.55080974e+02 1.82624476e+01 5.24967258e+00 2.00237404e+02
1716.lowfreq: -8.7238 -4.1029 -0.0015 -0.0015 -0.0014 6.0314 10.3785 13.3052 18.9008
frequency: 8.0745 12.3062 18.1266 22.8368 28.8677 29.5998 64.3742 73.9697 114.6698 121.5537 138.9159 170.2384 187.0541 208.1085 228.4425 231.6678 258.2885 307.9780 321.7523 357.1580 375.9108 400.4685 409.6102 410.4799 418.1626 447.1824 475.4404 481.7356 518.8366 535.2433 550.7093 595.3901 606.4980 611.4442 611.9016 627.4009 659.7270 690.7568 692.9441 695.8719 700.8912 762.7495 767.8035 777.6712 805.3042 824.9967 832.4782 835.6235 838.4483 849.1668 913.3920 914.7348 925.0054 968.7699 970.4822 975.7024 979.9069 985.5262 986.6431 989.7444 990.2338 991.3977 999.3925 1020.1999 1020.8939 1029.2017 1032.4141 1075.3114 1077.2692 1084.7501 1155.7113 1163.2062 1169.8721 1171.8418 1175.4028 1183.3171 1189.6445 1193.9649 1200.1211 1215.8694 1250.5068 1308.8048 1311.3093 1330.8356 1379.6107 1380.3219 1381.1760 1392.5084 1439.8034 1440.4789 1444.0032 1468.6319 1471.5450 1482.7302 1591.6003 1594.9104 1595.5299 1601.1908 1602.3337 1612.3530 3073.4215 3123.8574 3128.9086 3130.6418 3132.4798 3139.8394 3141.0583 3143.2389 3152.6349 3158.9627 3159.2181 3168.2569 3170.4595 3170.8936 3176.3738 3177.0278 3525.9128
redmass: 5.1346 4.3659 4.9008 4.3523 4.5022 4.6211 6.0622 6.7719 6.7198 6.5652 7.0173 5.2415 5.3500 5.2021 5.4236 6.1140 6.2438 7.0286 5.2023 5.9183 1.6639 3.0859 2.8786 2.9314 4.0073 4.9414 4.6503 4.1924 4.1125 5.0192 4.8592 5.8938 6.5542 6.3311 6.3637 6.2885 8.9842 2.1813 2.3425 4.6567 1.6480 1.5385 1.6026 2.2727 4.2523 6.6772 2.3259 1.6961 1.3902 1.2526 1.4259 1.4241 1.4482 1.3780 1.3732 1.4729 4.9594 4.3891 3.8107 1.4253 5.1710 1.5256 1.3694 2.1402 2.1919 2.3749 8.4002 1.5264 1.5400 1.5989 2.3716 1.5190 1.1277 1.1477 1.0611 1.3279 1.5267 1.2076 1.9624 1.2602 1.5750 1.3238 1.3257 1.2786 7.2289 3.3163 2.9518 2.3340 2.2359 2.2693 2.1275 2.1935 2.2350 2.2385 6.3245 6.2480 6.0866 6.4830 6.4112 5.9793 1.0862 1.0873 1.0870 1.0851 1.0852 1.0915 1.0900 1.0898 1.0962 1.0944 1.0941 1.1016 1.0962 1.0957 1.0999 1.1004 1.0655
irintensity: 0.0873 0.4805 0.3210 0.3048 1.3172 0.4244 1.6983 1.6920 2.3161 6.4125 2.2301 1.1650 8.3838 7.8040 6.6343 12.4914 10.0032 7.6413 6.5695 24.0231 172.6806 13.0963 1.2679 0.1507 44.0511 129.2711 41.3780 28.5640 32.8268 9.4042 18.5721 76.6874 11.5234 1.6194 1.0762 18.0825 87.5190 19.8298 28.0055 66.6923 77.8729 77.8370 103.6263 47.2373 36.2690 302.6924 68.8681 43.3694 16.3775 2.2459 6.0310 13.6305 4.6494 0.2899 0.5032 2.9471 73.7498 6.6721 5.5804 0.6537 3.4845 0.9776 1.3222 27.8263 20.9222 10.9327 72.6844 7.7948 11.9524 11.8292 260.3921 78.6162 28.4482 22.1311 0.6659 73.4566 80.0948 3.6669 41.3018 27.6427 16.8243 0.0997 0.3956 4.1745 4.3387 7.5272 14.6026 8.8759 6.0756 10.7011 12.6220 160.5224 97.1346 7.1741 43.9761 25.7326 6.0664 43.7017 34.3510 0.4351 3.1294 4.6664 0.4290 0.3216 0.2872 8.5928 17.4046 14.7328 28.3874 28.7580 27.1885 24.8731 5.1555 5.9059 11.1555 5.9863 31.1323
temp: 298.150 k
press: 1.00000 atm
elementType: 15 8 8 8 8 6 6 6 6 6 6 6 6 6 6 6 6 6 6 6 6 6 6 6 1 1 1 1 1 1 1 1 1 1 1 1 1 1 1 1 1
symmnumber: 1
zpe: 815961.6 jmol-1
zpe.correction: 0.310783 hartree
zpe.thermalcorrener: 0.333063 hartree
zpe.thermalcorrenthalpy: 0.334007 hartree
zpe.thermalcorrgfe: 0.253091 hartree
zpe.sumelectzpe: -1374.622480 hartree
zpe.sumelectthermal: -1374.600201 hartree
zpe.sumelectthermalent: -1374.599256 hartree
zpe.sumelectthermalfe: -1374.680173 hartree
dipole: -1.0843 0.3412 0.0323
dipole: 1.1372
quadrupole: -130.6184 -127.9385 -147.7360
quadrupole: -1.0129 4.2298 2.8780
quadrupole: 4.8126 7.4925 -12.3051 -1.0129 4.2298 2.8780
hfenergy: -1374.9332637 hartree
pointgroup: C01 [X(C19H17O4P1)]
dipole: 0.4343656 0.1072596 0.0008727 debye
polarizability: 272.5728863|2.2703247|251.1542418|-14.3965186|-15.4902981|201.6362494 unknown
InChI: InChI=1S/C19H17O4P/c20-19(16-10-4-1-5-11-16)24(21,22-17-12-6-2-7-13-17)23-18-14-8-3-9-15-18/h1-15,19-20H
charge 0 multiplicity 1
41 atoms
P  -0.153895 0.321921 -0.011155
O  -1.563213 -0.359143 0.782077
O  1.054041 -0.727787 0.7185
O  0.603749 1.495293 2.372993
O  -0.204367 0.36594 -1.602063
C  0.36635 1.895725 1.006067
C  1.514866 2.609479 0.315713
C  1.297902 3.886548 -0.255789
C  2.810267 2.032687 0.26275
C  -2.903107 -0.244949 0.308527
C  1.250547 -2.086598 0.329526
C  2.361628 4.584586 -0.869454
C  3.87243 2.732149 -0.347038
C  3.65171 4.009639 -0.914415
C  -3.246593 -0.314059 -1.061709
C  1.52169 -2.423183 -1.015766
C  -3.888522 -0.119505 1.313078
C  1.224572 -3.060425 1.349252
C  -4.613464 -0.248425 -1.417253
C  1.776368 -3.77618 -1.334941
C  -5.24871 -0.069047 0.937657
C  1.493778 -4.406243 1.013904
C  -5.616226 -0.129323 -0.427603
C  1.768039 -4.767757 -0.326273
H  -0.533364 2.531726 1.030597
H  0.298877 4.337775 -0.218728
H  2.984784 1.032825 0.67736
H  1.266009 0.754336 2.388383
H  2.184411 5.572334 -1.308441
H  4.869618 2.280396 -0.386775
H  4.477847 4.549992 -1.389512
H  -2.466198 -0.40875 -1.822328
H  1.526121 -1.645737 -1.785784
H  -3.576955 -0.071278 2.360774
H  0.991972 -2.75975 2.375203
H  -4.891181 -0.297707 -2.47604
H  1.985179 -4.051867 -2.374391
H  -6.018082 0.021299 1.712406
H  1.480239 -5.17077 1.798316
H  -6.671959 -0.08597 -0.7158
H  1.97084 -5.813193 -0.582025
