program: Gaussian 09
title: 000275774
version: EM64L-G09RevD.01
frameworkgroup: C1[X(C9H11NO2)]
method: RPBEPBE
basis: SDD
operation: Freq
keyword: #p
keyword: freq=noraman
keyword: PBEPBE/SDD
title: #p freq=noraman PBEPBE/SDD
converged: NO YES NO NO
title: Mulliken charges:
elementType: O O N C C C C C C C C C H H H H H H H H H H H
charge: -0.518142 -0.266315 -0.682959 0.001775 0.419492 0.170347 0.345581 -0.481967 -0.411616 -0.792896 -0.851804 0.116838 0.233825 0.227564 0.244334 0.244328 0.211721 0.226402 0.226831 0.240393 0.384804 0.322817 0.388647
chargesum: 0.00000
title: Mulliken charges with hydrogens summed into heavy atoms:
elementType: O O N C C C C C C C C C
charge: -0.129495 -0.266315 0.024662 0.001775 0.419492 0.170347 0.345581 -0.248142 -0.184052 -0.092514 -0.158178 0.116838
polarizability: 1.55496612e+02 3.19816790e+00 1.36829466e+02 -9.44188809e-03 1.75626731e-02 5.54064691e+01
1716.lowfreq: -8.7201 -5.8791 -0.0009 0.0002 0.0004 7.2075 41.9193 90.6880 123.5774
frequency: 41.7568 90.6828 123.5723 204.3010 225.9973 253.8292 255.5554 309.4411 325.2853 375.2385 380.9752 398.4294 428.1758 453.4393 471.5071 543.5487 578.1056 578.3049 599.3652 645.5463 695.7586 717.4380 732.7873 777.0729 816.0640 847.6929 945.2187 946.1839 972.9460 1014.4025 1043.5380 1046.3282 1080.2215 1138.3743 1175.0026 1190.9832 1263.6677 1275.3137 1325.1301 1371.8814 1392.7270 1408.3464 1433.7946 1455.6146 1462.2483 1473.9850 1480.6955 1489.8818 1590.9585 1601.8691 1623.0399 1634.4915 2947.0531 2990.5672 3013.5271 3076.9013 3084.3097 3088.3104 3120.1621 3150.1090 3457.1232 3531.4748 3669.0501
redmass: 8.3041 4.3379 2.9972 1.0764 1.0486 4.6144 3.7585 2.9016 3.2161 5.0462 5.1043 4.1703 1.2050 5.0820 2.5266 3.6116 3.0503 1.4816 3.3021 4.3083 2.6390 1.4354 4.8942 6.4962 1.2228 4.1954 1.3558 2.7245 2.3259 1.3765 1.5648 1.5153 2.3512 1.6589 1.4316 2.4628 1.9347 3.0829 2.8609 3.4846 1.3206 1.2642 3.1322 1.0461 1.1126 1.0449 1.3892 2.5593 4.0946 2.9456 2.1321 3.8491 1.0398 1.0365 1.0976 1.0959 1.0949 1.1012 1.0884 1.0958 1.0533 1.0642 1.0961
irintensity: 1.3173 0.0565 0.9541 2.5046 0.5095 0.9377 17.5332 3.0537 3.3062 2.8674 0.4915 6.5913 103.2802 3.1690 2.6449 24.6885 23.9171 105.5387 25.0150 19.9327 15.9251 145.0141 2.8091 20.8965 24.8092 8.8644 0.1937 91.0047 169.7473 9.1587 6.8251 9.2994 44.8234 18.0089 57.0491 21.1710 0.0572 35.3219 18.9340 72.5420 20.4669 6.5271 3.9341 11.2684 31.3273 14.6324 10.9586 157.7503 35.7916 55.9372 122.3652 484.3132 48.6831 23.5703 26.7405 11.4239 13.5822 27.1897 16.9694 23.5437 136.0785 44.2622 64.6743
temp: 298.150 k
press: 1.00000 atm
elementType: 8 8 7 6 6 6 6 6 6 6 6 6 1 1 1 1 1 1 1 1 1 1 1
symmnumber: 1
zpe: 483502.5 jmol-1
zpe.correction: 0.184156 hartree
zpe.thermalcorrener: 0.195679 hartree
zpe.thermalcorrenthalpy: 0.196623 hartree
zpe.thermalcorrgfe: 0.147150 hartree
zpe.sumelectzpe: -553.901287 hartree
zpe.sumelectthermal: -553.889764 hartree
zpe.sumelectthermalent: -553.888820 hartree
zpe.sumelectthermalfe: -553.938293 hartree
dipole: -2.7853 -1.9757 0.0063
dipole: 3.4148
quadrupole: -68.4693 -58.4925 -74.5555
quadrupole: -1.5113 -0.0281 -0.0174
quadrupole: -1.2969 8.6799 -7.3831 -1.5113 -0.0281 -0.0174
hfenergy: -554.085443 hartree
pointgroup: C01 [X(C9H11N1O2)]
dipole: -0.9679795 0.9303069 0.0502972 debye
dipolederiv: -0.4078563 -0.1945899 -0.0163437 -0.3777154 -1.2384913 -0.0797679 -0.0324069 -0.0749239 -0.4653511 -1.3212581 0.2023937 -0.0103442 0.1575526 -0.6300734 -0.023712 -0.0144908 -0.0223432 -0.3145774 -0.3014889 -0.0840517 0.0041087 0.1351676 -1.355436 -0.0601846 0.0236976 -0.0675961 -0.6418085 -0.9172937 0.0646335 -0.0181648 -0.4897957 -0.3845479 -0.040224 -0.0667089 -0.0233886 -0.093794 0.5279884 -0.261533 -0.0073424 0.454434 0.2558569 0.0344481 0.055576 0.0135916 0.0154435 0.13365 0.3486485 0.0305926 -0.2259604 1.2521454 0.0935425 -0.0204325 0.1103371 0.1265431 0.1942048 -0.5427006 -0.0389567 0.01112 -0.4175015 -0.028283 0.0108464 -0.0455206 -0.0965394 -0.7214942 0.2874292 0.0106378 0.0061899 -0.0593633 0.0148851 -0.0142727 0.0231524 -0.228435 0.2720046 -0.0881608 0.0043244 -0.2614992 0.3874944 0.0368633 -0.0105555 0.0420126 -0.1155853 -0.137088 0.2330496 0.0154242 0.0824515 0.0558635 0.004623 0.0026608 0.0085872 0.0287314 -0.0152136 0.0522991 0.0012747 0.0473137 0.0113292 -0.0065761 -0.0000874 -0.0063566 0.1027927 1.9647504 0.0931697 0.0573315 0.3778042 1.4323217 0.1185079 0.0824328 0.1101866 0.2284967 0.0694709 0.011037 -0.0019151 -0.0187659 -0.1295859 -0.0261388 -0.0046807 -0.0249707 0.1625036 -0.1166551 -0.0789873 -0.0147101 -0.068076 0.0727182 -0.0079183 -0.0137687 -0.0081732 0.1378688 0.0171021 0.018108 0.08789 -0.0054056 0.0635518 0.0501317 0.0981112 0.0154556 -0.013723 0.0276298 0.0328369 -0.080933 0.0135765 0.0719284 -0.0341911 -0.0949684 0.0020031 -0.0323845 0.0582364 -0.1569758 -0.0147974 -0.0167376 -0.1642689 -0.0230933 -0.0028679 -0.0272344 0.0979412 0.0473462 0.0190651 -0.0263893 0.0978206 -0.014174 -0.1117594 0.0532294 -0.1190546 -0.0723505 0.0470155 0.0082986 0.0334245 0.0990619 -0.0539977 0.1203709 -0.0312737 0.1231986 -0.0334234 -0.0734242 -0.0416501 -0.0083008 -0.1706873 0.0244922 -0.0119129 -0.0195048 -0.0086106 0.1114327 0.3643783 0.064338 0.0051766 0.0036786 0.232908 -0.0112882 -0.0001093 -0.0092451 0.3664147 0.1553264 0.0060608 -0.0055051 0.0236849 0.2414758 -0.0072718 -0.0045163 -0.0068862 0.3332555 0.1326682 0.0072814 -0.0064825 0.1247872 0.3453543 -0.001051 0.0040903 -0.0042212 0.396548 unknown
polarizability: 154.0635782|-6.0221027|137.5798246|2.3791289|7.0069592|56.0891443 unknown
InChI: InChI=1S/C9H11NO2/c1-5-3-4-6(2)8(10)7(5)9(11)12/h3-4,11H,10H2,1-2H3
charge 0 multiplicity 1
23 atoms
O  2.013816 1.947401 0.292329
O  3.03171 -0.10505 0.139222
N  -0.547874 2.190332 0.239251
C  0.570875 -0.0262 0.078196
C  0.420276 -1.459785 -0.051544
C  -0.613193 0.814726 0.116482
C  -1.92181 0.218153 0.025084
C  -0.875258 -2.002656 -0.137948
C  -2.022169 -1.173186 -0.100225
C  1.59161 -2.425252 -0.100382
C  -3.160559 1.093171 0.064584
C  1.938202 0.518621 0.163595
H  -0.993611 -3.08658 -0.235695
H  -3.017722 -1.628557 -0.170763
H  2.270096 -2.208664 -0.94389
H  2.220742 -2.358267 0.80401
H  1.21624 -3.458442 -0.200171
H  -3.232664 1.671773 1.008587
H  -3.18546 1.819627 -0.773783
H  -4.073033 0.478958 -0.010997
H  0.369613 2.63779 0.306376
H  -1.402097 2.738429 0.258163
H  2.978973 2.17996 0.338818
