program: Gaussian 09
title: 000275770
version: EM64L-G09RevD.01
frameworkgroup: C1[X(C12H15NO3)]
method: RPBEPBE
basis: SDD
operation: Freq
keyword: #p
keyword: freq=noraman
keyword: PBEPBE/SDD
title: #p freq=noraman PBEPBE/SDD
converged: YES YES NO NO
title: Mulliken charges:
elementType: O O O N C C C C C C C C C C C C H H H H H H H H H H H H H H H
charge: -0.290723 -0.274748 -0.256340 -0.465797 0.120072 0.354217 0.130216 0.534991 -0.506916 -0.584312 -0.878691 -0.817911 0.158647 0.218120 -0.785278 -0.497664 0.316194 0.282698 0.221359 0.223938 0.328009 0.330975 0.234081 0.234224 0.224214 0.214722 0.258767 0.258792 0.231425 0.241287 0.241429
chargesum: 0.00000
title: Mulliken charges with hydrogens summed into heavy atoms:
elementType: O O O N C C C C C C C C C C C C
charge: -0.290723 -0.274748 -0.256340 -0.134822 0.120072 0.354217 0.130216 0.534991 -0.190721 -0.301614 -0.105385 -0.125392 0.158647 0.218120 -0.052996 0.216477
polarizability: 2.25525404e+02 2.08687641e+00 1.70069836e+02 -9.29892525e-02 3.38997093e-01 7.87723239e+01
1716.lowfreq: -13.4284 -8.9952 -4.0456 -0.0007 -0.0002 0.0002 15.0051 39.2679 45.5086
frequency: 14.7748 39.2629 45.4958 48.2073 61.7540 99.8271 110.2373 117.9862 127.7643 165.1502 189.1674 199.3021 249.6683 252.1434 269.9490 321.8062 342.3292 352.0739 385.1404 404.5904 463.9275 499.2710 505.7145 564.7340 566.0873 612.0766 652.5578 674.7905 715.9411 720.2115 760.4350 761.3261 842.3387 905.6334 919.5557 947.1216 955.8665 974.0883 994.6227 1016.1188 1034.3860 1039.8369 1042.4098 1055.2874 1112.5909 1129.4976 1144.7234 1171.8169 1211.2552 1238.5652 1256.1484 1304.4888 1372.4492 1387.7765 1391.9121 1397.3954 1419.4663 1422.6063 1439.6274 1448.5097 1450.2318 1462.2790 1463.7761 1469.3221 1470.0191 1478.9692 1511.4056 1529.2131 1586.7212 1605.3702 1619.0169 1629.1609 2948.6584 2979.7117 2994.8300 3002.9333 3016.0223 3058.9307 3087.5183 3096.7004 3097.7816 3103.7516 3125.5301 3145.9384 3171.5396 3178.3887 3549.0142
redmass: 5.9427 1.5413 1.1387 2.7319 2.1280 1.2193 2.6778 4.0594 2.7825 3.4582 1.7041 1.8022 3.0979 7.5547 3.1845 4.0095 3.6674 3.7790 5.4218 4.8750 4.7974 4.1322 4.4320 3.0912 3.4694 3.1289 1.2992 5.7196 4.9458 5.3125 3.5089 4.7851 5.4535 1.4738 4.8219 2.6773 1.3658 3.1948 1.8486 1.4304 3.4336 1.6284 1.5245 1.5768 1.2634 3.1176 1.4702 4.7101 1.7187 1.9074 2.2657 3.8235 4.4814 1.2381 1.2764 1.2338 3.0640 1.2378 2.7437 1.0453 1.0503 1.2846 1.0538 1.0452 1.1135 1.1512 1.0537 1.9640 5.6394 7.8414 8.2053 3.9633 1.0421 1.0371 1.0361 1.0295 1.0973 1.0976 1.0991 1.1005 1.0980 1.1043 1.0924 1.1046 1.0929 1.0920 1.0757
irintensity: 1.4467 0.2667 3.8337 6.5730 2.6960 1.1169 0.0201 4.1446 5.7879 5.7756 0.1328 3.0880 0.6970 0.1971 5.8270 4.9023 0.4729 7.4730 13.8306 0.0405 1.5940 9.1512 14.7840 4.0885 14.8153 0.1030 58.2118 0.9804 11.3666 5.2462 6.5183 1.6681 9.0101 21.5282 1.0648 21.0431 5.4787 9.1528 4.3147 2.2231 236.6380 11.2556 4.8829 18.3755 0.1561 27.5070 72.2792 213.0342 23.2304 112.8276 2.9246 71.6723 141.8458 53.0904 46.5509 10.3920 98.5630 22.5424 116.3958 15.0608 13.5676 26.5032 10.4019 13.1966 21.1558 78.3195 20.5214 315.7124 18.5694 273.3524 2.4772 79.1339 39.2662 31.5224 12.2423 45.2056 21.4753 17.9332 17.9127 19.6758 7.1994 27.4539 12.2628 16.5509 10.1903 1.8755 28.1420
temp: 298.150 k
press: 1.00000 atm
elementType: 8 8 8 7 6 6 6 6 6 6 6 6 6 6 6 6 1 1 1 1 1 1 1 1 1 1 1 1 1 1 1
symmnumber: 1
zpe: 650185.5 jmol-1
zpe.correction: 0.247643 hartree
zpe.thermalcorrener: 0.265118 hartree
zpe.thermalcorrenthalpy: 0.266062 hartree
zpe.thermalcorrgfe: 0.199822 hartree
zpe.sumelectzpe: -745.539358 hartree
zpe.sumelectthermal: -745.521883 hartree
zpe.sumelectthermalent: -745.520939 hartree
zpe.sumelectthermalfe: -745.587179 hartree
dipole: 0.9591 -1.5986 0.1274
dipole: 1.8686
quadrupole: -86.0832 -90.3743 -95.9755
quadrupole: 17.5553 0.4570 -0.7257
quadrupole: 4.7278 0.4367 -5.1645 17.5553 0.4570 -0.7257
hfenergy: -745.7870007 hartree
pointgroup: C01 [X(C12H15N1O3)]
dipole: -0.4134028 0.6029976 0.0771784 debye
polarizability: 224.4987555|4.2241663|169.7414916|10.0386069|8.0624632|80.1273166 unknown
InChI: InChI=1S/C12H15NO3/c1-7-5-10(12(15)16-4)8(2)11(6-7)13-9(3)14/h5-6,13H,1-4H3
charge 0 multiplicity 1
31 atoms
O  -3.662058 -0.285759 -0.288344
O  -2.987673 1.925099 -0.252643
O  4.049102 -0.535774 0.124657
N  2.305475 1.048214 0.147721
C  -0.124782 0.917388 -0.03635
C  1.140639 0.240055 -0.010979
C  -1.294583 0.111724 -0.194444
C  0.0661 -1.950046 -0.293091
C  1.233425 -1.166261 -0.138251
C  -1.183684 -1.30379 -0.318629
C  -0.145216 2.432331 0.115004
C  0.174551 -3.458356 -0.428058
C  -2.66892 0.706557 -0.243947
C  3.647174 0.662711 0.20674
C  4.629151 1.820987 0.381692
C  -5.05249 0.215656 -0.353845
H  2.222443 -1.629963 -0.11354
H  -2.099711 -1.886549 -0.436871
H  0.307227 2.745203 1.078567
H  0.417307 2.926088 -0.704231
H  -1.170911 2.820171 0.084021
H  2.130828 2.050862 0.228192
H  0.786782 -3.737949 -1.305619
H  0.661079 -3.904708 0.459202
H  -0.817913 -3.926207 -0.542818
H  4.150555 2.81397 0.443337
H  5.336865 1.819928 -0.465188
H  5.219138 1.653563 1.299212
H  -5.674228 -0.69049 -0.37574
H  -5.200058 0.822653 -1.263054
H  -5.280013 0.834092 0.530701
