program: Gaussian 09
title: 000277545
version: EM64L-G09RevD.01
frameworkgroup: C1[X(C8H6ClN3)]
method: RPBEPBE
basis: SDD
operation: Freq
keyword: #p
keyword: freq=noraman
keyword: PBEPBE/SDD
title: #p freq=noraman PBEPBE/SDD
converged: YES YES NO NO
title: Mulliken charges:
elementType: Cl N N N C C C C C C C C H H H H H H
charge: -0.054525 0.006498 -0.575867 -0.022310 0.372324 -0.343602 -0.360933 -0.212935 -0.209266 -0.107154 0.046748 -0.254503 0.250019 0.271870 0.257847 0.256398 0.344327 0.335064
chargesum: 0.00000
title: Mulliken charges with hydrogens summed into heavy atoms:
elementType: Cl N N N C C C C C C C C
charge: -0.054525 0.006498 0.103524 -0.022310 0.372324 -0.093584 -0.089063 0.044912 0.047133 -0.107154 0.046748 -0.254503
polarizability: 2.11427555e+02 -7.70118746e+00 1.21764084e+02 -3.25628468e-02 4.95507868e-03 4.30900838e+01
1716.lowfreq: -5.1972 -2.8461 -2.1298 -0.0017 0.0007 0.0013 48.2667 69.5245 99.8914
frequency: 48.2663 69.5229 99.8907 141.8000 193.7492 261.9440 276.9384 290.3151 345.5796 390.9482 407.8631 477.5397 497.3010 502.0272 504.7284 576.2349 624.0105 675.5976 692.6713 721.9027 733.7560 828.2887 843.3699 957.6491 979.8783 989.2774 1012.5915 1073.4506 1107.9822 1166.1104 1187.2574 1218.4474 1298.3886 1331.6598 1369.7140 1402.6984 1481.0161 1516.7119 1577.9069 1600.4360 1649.1416 2138.3857 3137.7452 3157.7983 3173.0692 3178.0995 3410.1387 3666.2358
redmass: 4.7929 8.2113 11.8056 5.7993 6.8333 6.8894 3.6996 11.5990 6.9643 4.9044 2.9264 5.8683 2.5385 8.7757 1.2863 1.5160 7.1682 4.1025 6.1013 3.5135 6.5722 1.3006 1.5040 1.3643 1.3573 6.6443 4.1108 2.5961 1.5018 3.6469 1.1954 1.5988 1.2708 3.3006 6.2567 3.7171 2.6896 9.0009 7.7103 6.0905 1.0977 12.6479 1.0899 1.0883 1.0953 1.0973 1.0511 1.0959
irintensity: 1.2937 0.1059 2.1780 5.7189 2.6040 5.1138 8.6510 5.7649 1.0249 4.0926 0.1254 14.8915 111.3312 14.8301 184.3173 64.8075 0.1464 0.0362 5.0681 3.2715 5.2618 14.9646 61.7120 0.5271 0.8454 72.0119 4.1596 55.5122 19.1161 47.2787 1.9652 40.7767 2.6208 42.0369 4.0393 13.8524 34.5418 199.9334 4.0267 12.4837 47.6572 21.0743 5.3014 0.5920 3.8969 2.0953 56.2507 95.0793
temp: 298.150 k
press: 1.00000 atm
elementType: 17 7 7 7 6 6 6 6 6 6 6 6 1 1 1 1 1 1
symmnumber: 1
zpe: 328889.5 jmol-1
zpe.correction: 0.125267 hartree
zpe.thermalcorrener: 0.136163 hartree
zpe.thermalcorrenthalpy: 0.137107 hartree
zpe.thermalcorrgfe: 0.087614 hartree
zpe.sumelectzpe: -931.883551 hartree
zpe.sumelectthermal: -931.872655 hartree
zpe.sumelectthermalent: -931.871711 hartree
zpe.sumelectthermalfe: -931.921204 hartree
dipole: 2.7273 -2.7641 0.0036
dipole: 3.8831
quadrupole: -69.7832 -73.4719 -79.6993
quadrupole: -14.6786 0.0117 0.0068
quadrupole: 4.5350 0.8462 -5.3812 -14.6786 0.0117 0.0068
hfenergy: -932.0088179 hartree
pointgroup: C01 [X(C8H6Cl1N3)]
dipole: -1.0456835 -1.1136291 0.0180465 debye
dipolederiv: -1.0118212 -0.0420316 0.027968 -0.0350797 -0.1270352 0.0003867 0.0276676 0.0005832 -0.0689906 1.0733862 0.9700116 -0.0266732 0.3681826 0.0300659 -0.0112073 -0.0336289 -0.0307126 -0.0739572 -1.528704 -0.8475782 0.0190429 -0.0853206 -0.0022741 0.0092843 0.0295652 0.0352581 -0.6482445 -0.2566724 0.1729684 0.0014765 -0.0132108 -0.3468115 0.0000502 -0.0001878 -0.0065644 -0.2565502 0.3400841 -0.0014996 -0.0099866 0.144752 -0.1035678 -0.0058272 -0.0088779 -0.001578 0.0180669 -0.0179211 -0.0531963 -0.0044007 -0.0212972 0.0445322 0.0029319 -0.0044045 0.0038516 -0.1464453 -0.0549656 0.0712252 -0.0017242 -0.0155548 0.0276367 0.0023983 -0.0028652 -0.0003012 -0.1429939 -0.327976 0.0664876 0.0074833 0.1571196 0.0228987 -0.003305 0.0085632 -0.0004652 -0.1050066 -0.3361174 -0.1078305 0.0058683 -0.16756 -0.0015643 0.0062325 0.0050344 0.0043839 -0.1015576 1.3365384 0.0522645 -0.0416806 0.0786198 0.1331152 -0.0000622 -0.0410085 0.0007921 -0.0730853 0.3757707 -0.0512905 -0.0101349 -0.569723 -0.2545169 0.0149239 -0.0150936 -0.0007174 0.0577206 -0.113094 -0.3005037 0.0032738 -0.0047647 0.2557782 0.0015995 0.0064662 0.0111462 0.0890957 0.0346704 0.0799567 0.0045851 0.08413 -0.0033864 -0.0044322 0.0046532 -0.0043255 0.1572822 0.0778937 -0.0775885 0.0014523 -0.0425754 0.0103984 -0.0003744 0.0018602 0.0007322 0.1563011 0.0519721 -0.0609993 0.0027893 -0.0670641 -0.00617 0.0000323 0.0026805 -0.0002055 0.1670925 0.0349028 0.0708299 0.0047403 0.0689961 0.0021023 -0.0039216 0.0046808 -0.0039491 0.1640851 0.2031513 0.0214482 0.0062687 0.1478899 0.2611275 -0.0061545 0.0065986 -0.002942 0.3942348 0.1189022 0.0373262 0.0096517 -0.0275397 0.057671 -0.0025552 0.0082963 -0.0049865 0.4129522 unknown
polarizability: 210.8394812|9.9322484|122.1902089|-5.0513716|0.5801106|43.2520328 unknown
InChI: InChI=1S/C8H6ClN3/c9-7-3-1-6(2-4-7)8(5-10)12-11/h1-4H,11H2
charge 0 multiplicity 1
18 atoms
Cl 4.566647 0.089169 -0.09617
N  -2.169453 -1.331556 0.09254
N  -3.517523 -1.394676 0.135418
N  -3.051571 2.022367 0.158902
C  -0.069905 -0.090362 0.040644
C  0.604481 1.16047 0.034653
C  0.699924 -1.286263 0.004054
C  2.013666 1.223341 -0.007039
C  2.105759 -1.235938 -0.037743
C  2.74518 0.021863 -0.042697
C  -1.546993 -0.144924 0.084811
C  -2.316551 1.075903 0.123325
H  0.030625 2.093808 0.062819
H  0.183459 -2.250467 0.008843
H  2.528864 2.187898 -0.011354
H  2.696631 -2.155823 -0.065936
H  -3.917697 -2.32781 0.137243
H  -4.125441 -0.565699 0.162189
