program: Gaussian 09
title: 000275759
version: EM64L-G09RevD.01
frameworkgroup: C1[X(C21H22NO3P)]
method: RPBEPBE
basis: SDD
operation: Freq
keyword: #p
keyword: freq=noraman
keyword: PBEPBE/SDD
title: #p freq=noraman PBEPBE/SDD
converged: YES YES NO NO
title: Mulliken charges:
elementType: P O O O N C C C C C C C C C C C C C C C C C C C C C H H H H H H H H H H H H H H H H H H H H H H
charge: 1.394213 -0.474138 -0.535986 -0.616478 -0.747459 -0.512726 0.478502 -0.461180 -0.455998 0.470931 0.513970 -0.431203 -0.364705 -0.352658 -0.374289 -0.392053 -0.423523 -0.219125 -0.225107 -0.237794 -0.222817 -0.231487 -0.231091 -0.222220 -0.238250 -0.234227 0.230849 0.252141 0.356694 0.232955 0.226496 0.236711 0.240096 0.228443 0.282034 0.252063 0.290316 0.232443 0.230504 0.225289 0.227972 0.228110 0.230842 0.228038 0.230066 0.225384 0.231766 0.227688
chargesum: 0.00000
title: Mulliken charges with hydrogens summed into heavy atoms:
elementType: P O O O N C C C C C C C C C C C C C C C C C C C C C
charge: 1.394213 -0.474138 -0.535986 -0.616478 -0.390765 -0.029737 0.478502 -0.001728 0.020809 0.470931 0.513970 -0.202760 -0.082671 -0.100595 -0.083973 -0.159610 -0.193020 0.006164 0.002865 -0.009684 0.008024 -0.003450 -0.001025 0.003164 -0.006484 -0.006539
polarizability: 2.97943951e+02 -6.13417482e+00 2.57607911e+02 4.77682434e+00 -1.99210311e+00 2.05227329e+02
1716.lowfreq: -13.8515 -5.9193 -4.8924 -4.3601 0.0013 0.0014 0.0019 13.6561 20.3752
frequency: -13.1445 13.5065 20.3428 22.4251 27.3439 34.2243 37.3232 42.7230 59.6282 77.0199 105.0916 113.6065 138.9290 165.7230 178.3343 218.2343 226.2309 258.4229 285.2013 300.5882 328.3023 348.4905 370.9575 392.2879 399.9560 403.8582 405.3699 421.5668 430.1552 467.7246 478.3879 487.9448 510.1053 567.5870 582.6339 585.0249 615.3436 616.1465 617.2531 619.4922 686.1672 701.5514 706.5854 708.9064 752.9731 757.7811 760.7335 790.6107 808.8600 810.2301 820.0026 853.4851 859.1330 861.3752 896.1391 908.0005 922.2537 923.9315 929.2237 972.8526 973.3491 976.9055 978.4891 983.3675 984.0467 988.7111 989.5292 990.4127 997.8856 1002.8435 1004.9436 1025.9202 1027.1524 1027.9181 1044.8921 1075.6002 1088.4731 1091.7816 1096.0016 1172.5272 1172.7772 1173.2343 1188.3434 1192.1450 1194.4781 1205.9613 1209.9246 1219.3370 1223.0396 1225.9081 1227.5367 1318.9119 1320.2762 1332.1016 1335.8656 1346.2364 1350.4803 1384.8986 1386.3250 1387.0911 1395.5347 1440.0526 1441.9856 1442.5732 1464.0593 1464.5277 1466.6213 1484.7435 1485.5573 1486.4187 1594.3106 1594.7144 1594.8826 1614.0252 1614.4473 1615.8313 2991.4063 2998.1591 3002.6295 3046.3110 3070.1259 3087.0050 3112.0126 3117.1908 3117.6063 3120.3750 3122.8623 3127.4471 3130.6343 3131.7819 3138.7652 3144.5729 3145.4673 3149.5940 3162.0116 3162.1967 3165.1139 3539.9968
redmass: 4.6381 6.2209 4.9592 4.0289 4.6173 3.8937 4.4953 4.9642 5.4082 5.4160 5.5175 4.5018 5.9460 4.9938 6.0139 5.9367 5.3100 6.2272 3.1132 3.4760 2.6397 3.6542 4.2540 3.6462 2.8020 2.8270 2.8354 3.8025 3.9578 2.3990 3.5804 2.9450 2.4008 5.6782 4.9542 4.6851 6.0743 6.2995 6.2854 5.5889 6.8610 1.8178 1.7476 1.8860 1.8762 1.9205 2.1228 4.5842 3.5167 3.5991 3.5263 1.2511 1.2534 1.2520 5.9884 4.0628 1.6171 1.4238 1.6097 1.7834 1.8352 1.4182 1.7503 1.4360 1.3791 6.1821 4.8836 6.1117 1.3254 1.3709 1.3536 2.2059 2.2963 2.2218 7.1527 3.3544 1.5356 1.5857 1.8711 1.0548 1.0550 1.0559 1.1152 1.1261 1.1365 1.3603 2.1299 1.5131 1.3759 1.8726 1.5503 1.2947 1.2927 1.2728 1.2463 1.2709 1.2558 7.7854 6.7535 6.0844 1.3045 2.1247 2.1171 2.1660 1.1300 1.1135 1.1248 2.2484 2.1480 2.2593 6.0948 6.0514 6.0365 6.0659 5.8954 5.8885 1.0601 1.0598 1.0629 1.1038 1.1050 1.1034 1.0876 1.0864 1.0893 1.0893 1.0851 1.0876 1.0903 1.0915 1.0922 1.0955 1.0959 1.0966 1.1014 1.1014 1.1016 1.0757
irintensity: 0.8317 0.6626 0.0376 0.0735 0.1010 0.0875 1.0354 2.4305 1.7667 0.7305 0.2728 2.0056 0.4995 4.1222 16.4752 3.4832 0.8517 2.8335 1.9096 3.6445 27.1105 12.2638 11.0057 4.5353 0.0666 0.8932 0.8883 35.6837 9.8220 54.3130 42.0366 9.5716 47.6874 32.3865 15.1641 0.1883 9.0249 1.2361 0.9443 34.6877 93.2553 46.4007 58.1282 57.3782 43.1719 95.1845 105.1907 117.8746 12.3059 4.4734 143.2605 1.0703 1.2799 0.9063 308.9710 273.7643 16.0211 4.4589 28.2182 20.0038 15.5928 0.6208 2.5164 4.0609 0.6184 1.1222 1.0707 0.2516 0.0853 2.2212 6.0388 3.3605 10.1692 2.9615 90.0485 100.7436 7.6205 3.8602 14.5748 0.0664 0.1223 0.1264 0.2733 1.0007 0.2206 11.4859 9.5510 27.9357 26.5357 18.1459 6.2823 3.7019 5.9107 7.3611 2.9570 0.5528 14.8270 0.1910 2.8393 2.0876 68.4740 10.6648 9.2511 7.6326 8.2960 10.9665 22.4984 6.9146 7.9914 8.3196 0.5905 0.0588 1.7025 0.3377 1.9253 0.0176 33.2200 37.4418 22.2699 11.8601 7.5198 7.2486 9.0771 5.1061 2.1000 3.2621 3.5818 0.1457 4.7046 6.8239 14.4503 28.5952 31.9518 33.4659 20.4137 47.8021 19.1102 26.4603
temp: 298.150 k
press: 1.00000 atm
elementType: 15 8 8 8 7 6 6 6 6 6 6 6 6 6 6 6 6 6 6 6 6 6 6 6 6 6 1 1 1 1 1 1 1 1 1 1 1 1 1 1 1 1 1 1 1 1 1 1
symmnumber: 1
zpe: 1000696.9 jmol-1
zpe.correction: 0.381145 hartree
zpe.thermalcorrener: 0.404927 hartree
zpe.thermalcorrenthalpy: 0.405871 hartree
zpe.thermalcorrgfe: 0.322741 hartree
zpe.sumelectzpe: -1433.198278 hartree
zpe.sumelectthermal: -1433.174496 hartree
zpe.sumelectthermalent: -1433.173551 hartree
zpe.sumelectthermalfe: -1433.256682 hartree
dipole: 1.5736 -1.0892 3.5783
dipole: 4.0579
quadrupole: -142.1021 -145.4031 -162.6774
quadrupole: 1.1703 -2.1819 -2.4051
quadrupole: 7.9588 4.6578 -12.6165 1.1703 -2.1819 -2.4051
hfenergy: -1433.5794229 hartree
pointgroup: C01 [X(C21H22N1O3P1)]
dipole: 0.2058817 0.9667564 -1.2537119 debye
polarizability: 265.4723048|16.7983117|288.1153203|9.3100726|10.6646798|207.1915661 unknown
InChI: InChI=1S/C21H22NO3P/c23-26(22-16-19-10-4-1-5-11-19,24-17-20-12-6-2-7-13-20)25-18-21-14-8-3-9-15-21/h1-15,22H,16-18H2
charge 0 multiplicity 1
48 atoms
P  -0.887998 0.186712 0.811471
O  -1.175703 1.663265 1.692202
O  0.490834 0.463642 -0.197804
O  -0.831598 -0.998245 1.873299
N  -2.033169 0.093738 -0.470541
C  -3.35841 -0.548618 -0.286351
C  -3.440571 -1.958366 -0.867533
C  -1.39217 2.942837 0.945381
C  1.838483 0.614131 0.454144
C  -0.092407 3.66386 0.653153
C  2.668752 -0.639216 0.285735
C  -4.332003 -2.246825 -1.929576
C  -2.622456 -2.995684 -0.34688
C  0.734943 4.101069 1.720006
C  2.335549 -1.821983 0.99744
C  0.315362 3.912781 -0.68022
C  3.792782 -0.641556 -0.576515
C  -4.409302 -3.552502 -2.4696
C  -2.699601 -4.297983 -0.885556
C  -3.59235 -4.580703 -1.948016
C  1.947842 4.773848 1.456849
C  3.120853 -2.984588 0.846559
C  1.526193 4.592631 -0.947534
C  4.581667 -1.805734 -0.724455
C  2.345566 5.024238 0.121057
C  4.246961 -2.979654 -0.01186
H  -4.13078 0.097258 -0.744904
H  -3.560546 -0.574016 0.801285
H  -1.637498 0.086868 -1.414799
H  -2.027583 3.514453 1.644042
H  -1.962602 2.735562 0.019682
H  1.690561 0.866615 1.521605
H  2.290441 1.479853 -0.056636
H  -4.969805 -1.450388 -2.334576
H  -1.931956 -2.772619 0.476743
H  0.428073 3.900796 2.75326
H  1.454107 -1.827292 1.651087
H  -0.310445 3.566026 -1.51119
H  4.05192 0.2686 -1.131915
H  -5.102333 -3.76495 -3.291576
H  -2.066894 -5.09375 -0.476528
H  -3.649907 -5.593063 -2.363844
H  2.579803 5.106759 2.287806
H  2.85753 -3.893979 1.398372
H  1.829594 4.782086 -1.983273
H  5.450993 -1.797149 -1.391617
H  3.28399 5.551917 -0.083399
H  4.856684 -3.883388 -0.124779
