program: Gaussian 09
title: 000277540
version: EM64L-G09RevD.01
frameworkgroup: C1[X(C9H18N2)]
method: RPBEPBE
basis: SDD
operation: Freq
keyword: #pfreq=noraman
keyword: PBEPBE/SDD
title: #p freq=noraman PBEPBE/SDD
converged: YES YES NO NO
title: Mulliken charges:
elementType: N N C C C C C C C C C H H H H H H H H H H H H H H H H H H
charge: -0.061188 -0.117922 -0.394012 -0.362711 -0.389829 -0.395868 -0.488203 -0.515402 0.173476 -0.600088 -0.629054 0.201098 0.187516 0.185950 0.199099 0.215511 0.200008 0.189498 0.201572 0.224753 0.188824 0.209872 0.243709 0.242844 0.202572 0.208780 0.211650 0.246369 0.221176
chargesum: 0.00000
title: Mulliken charges with hydrogens summed into heavy atoms:
elementType: N N C C C C C C C C C
charge: -0.061188 -0.117922 -0.005398 0.022338 0.025689 -0.004797 -0.074626 -0.061821 0.173476 0.054108 0.050142
polarizability: 1.45217283e+02 9.25124292e-02 1.03765991e+02 -4.87088658e+00 -5.66783603e-01 9.01068782e+01
1716.lowfreq: -15.6819 -0.0003 0.0004 0.0006 7.5525 15.8888 51.9654 76.6252 131.9965
frequency: 51.6201 76.5966 131.9712 147.1623 174.9835 208.4827 220.5275 226.9683 299.8242 309.3700 332.0378 358.4826 396.0543 436.2274 458.9682 486.8053 522.4862 618.8034 713.7608 764.7694 802.0978 815.5070 857.4299 866.6599 898.8148 946.6389 961.4038 987.5864 1008.5834 1011.3370 1051.9781 1074.5690 1084.0952 1125.9364 1127.1999 1143.6117 1178.4955 1190.3683 1205.8101 1216.4750 1224.1284 1258.7943 1266.1780 1286.7047 1320.8256 1330.8276 1338.8932 1345.8556 1349.6952 1355.5246 1411.1643 1433.0548 1450.0022 1456.1817 1456.7540 1461.1713 1462.0892 1469.1311 1471.2035 1474.7287 1475.4271 1488.2305 1571.2691 2908.2387 2920.4586 2938.4824 2954.8107 2965.8921 2968.0237 2973.7415 2983.0651 2989.7495 3012.7651 3024.3789 3026.2874 3037.6071 3046.4928 3050.4894 3064.7811 3105.7464 3114.1820
redmass: 2.6712 2.9643 2.4787 1.8391 1.4272 1.9548 2.3896 1.2125 2.3819 2.3844 2.2419 2.8013 2.5392 2.1182 3.1576 2.0552 2.5249 2.5092 3.3812 3.6787 2.1950 1.5576 1.6981 2.7604 2.2142 2.4629 2.3629 1.6322 2.3089 1.6400 1.6065 1.9298 1.2476 1.9916 1.5324 1.3618 1.3807 1.4320 2.3294 1.3843 2.0571 1.2771 1.3820 1.3931 1.5314 1.4218 1.4724 1.5309 1.4019 1.4437 1.1383 1.1632 1.0742 1.0565 1.1042 1.0846 1.0863 1.0486 1.0858 1.0796 1.0555 1.0514 7.6745 1.0523 1.0497 1.0596 1.0609 1.0614 1.0669 1.0622 1.0654 1.0942 1.0976 1.1001 1.1002 1.1011 1.0807 1.0815 1.0981 1.0988 1.1000
irintensity: 0.2926 0.7552 2.7435 2.5482 1.6880 0.2092 0.8049 0.1909 0.6871 4.9166 0.2083 12.3754 3.0066 7.8988 8.8705 0.2500 1.7885 1.9849 3.8998 9.2323 5.8502 4.4420 2.7645 7.2048 0.2833 18.0504 57.8519 23.0390 13.2336 12.9810 2.1803 0.5247 1.1777 0.4299 10.7339 0.5115 7.4927 2.2212 0.8065 3.7890 1.4040 0.2225 2.4171 0.0573 3.7143 2.0539 0.1156 1.4055 1.3487 0.9962 3.6849 3.0667 9.1690 13.4752 16.7159 7.3849 5.0240 6.5108 8.3934 16.4098 3.5197 29.9675 8.7729 79.2518 170.4754 24.1294 30.1024 26.0709 28.0463 40.2194 23.2027 29.2025 60.9687 60.0555 35.9803 102.3278 10.3935 66.1633 23.5876 25.8774 22.7660
temp: 298.150 k
press: 1.00000 atm
elementType: 7 7 6 6 6 6 6 6 6 6 6 1 1 1 1 1 1 1 1 1 1 1 1 1 1 1 1 1 1
symmnumber: 1
zpe: 680277.6 jmol-1
zpe.correction: 0.259104 hartree
zpe.thermalcorrener: 0.271196 hartree
zpe.thermalcorrenthalpy: 0.272140 hartree
zpe.thermalcorrgfe: 0.221516 hartree
zpe.sumelectzpe: -462.306028 hartree
zpe.sumelectthermal: -462.293936 hartree
zpe.sumelectthermalent: -462.292992 hartree
zpe.sumelectthermalfe: -462.343616 hartree
dipole: 0.1875 1.3900 -0.3612
dipole: 1.4483
quadrupole: -63.2629 -69.2970 -69.2259
quadrupole: -2.1278 -0.6525 -1.6590
quadrupole: 3.9991 -2.0351 -1.9640 -2.1278 -0.6525 -1.6590
hfenergy: -462.5651322 hartree
pointgroup: C01 [X(C9H18N2)]
dipole: -0.0408612 -0.4226157 -0.3800109 debye
polarizability: 144.7563108|-0.9952492|100.3270783|6.7703598|5.9983356|94.006763 unknown
InChI: InChI=1S/C9H18N2/c1-11(2)10-9-7-5-3-4-6-8-9/h3-8H2,1-2H3
charge 0 multiplicity 1
29 atoms
N  1.232891 0.782887 0.270569
N  2.304779 -0.169034 0.516308
C  -3.02354 0.146145 0.51087
C  -2.386531 -1.265275 0.467396
C  -2.026682 1.321748 0.624928
C  -1.572487 -1.549346 -0.821955
C  -0.949623 1.394296 -0.499687
C  -0.0935 -1.089589 -0.777898
C  0.144941 0.348582 -0.339988
C  3.218302 0.441923 1.511111
C  3.042595 -0.59001 -0.704307
H  -3.726501 0.199124 1.366989
H  -3.637539 0.279903 -0.404939
H  -3.201358 -2.01218 0.54722
H  -1.737698 -1.41321 1.355245
H  -1.501006 1.278371 1.599234
H  -2.599901 2.270596 0.616285
H  -2.093203 -1.084434 -1.683905
H  -1.565382 -2.639343 -1.021273
H  -0.467533 2.386774 -0.461276
H  -1.440995 1.294028 -1.488415
H  0.347505 -1.254933 -1.784729
H  0.486767 -1.732971 -0.081938
H  2.630733 0.763534 2.384287
H  3.760634 1.32757 1.108603
H  3.952797 -0.316851 1.834931
H  3.444063 0.282262 -1.270904
H  2.399164 -1.178772 -1.375637
H  3.888704 -1.229095 -0.397024
