program: Gaussian 09
title: 000277527
version: EM64L-G09RevD.01
frameworkgroup: C1[X(C5H9N3O)]
method: RPBEPBE
basis: SDD
operation: Freq
keyword: #pfreq=noraman
keyword: PBEPBE/SDD
title: #p freq=noraman PBEPBE/SDD
converged: YES YES NO NO
title: Mulliken charges:
elementType: O N N N C C C C C H H H H H H H H H
charge: -0.251977 0.097181 -0.407988 -0.652607 -0.413401 -0.492710 -0.539864 0.024306 0.293752 0.229715 0.229324 0.243501 0.244018 0.237914 0.237618 0.280145 0.343457 0.297617
chargesum: 0.00000
title: Mulliken charges with hydrogens summed into heavy atoms:
elementType: O N N N C C C C C
charge: -0.251977 0.097181 -0.127843 -0.011533 0.045638 -0.005191 -0.064333 0.024306 0.293752
polarizability: 1.25759747e+02 1.67753559e+00 7.83609318e+01 6.08129576e-02 -3.64899171e-02 4.60018456e+01
1716.lowfreq: -0.0009 -0.0007 -0.0004 3.6864 4.9414 13.9949 33.6334 53.7023 106.9824
frequency: 31.9962 53.3346 106.9761 110.8603 237.5680 248.6488 292.7425 367.6752 425.5772 484.8939 529.7236 559.6425 579.3553 709.8881 737.4346 744.2163 757.4083 845.5359 916.8827 939.5657 958.8913 998.3163 1039.5066 1060.4268 1098.5831 1164.5194 1180.6940 1189.8672 1205.4943 1240.4291 1260.4823 1292.8652 1432.4155 1442.6804 1468.3515 1493.5672 1602.2312 1666.4110 1681.9019 2981.1339 3011.2256 3041.1981 3042.3824 3072.1989 3116.1967 3404.4241 3538.5930 3697.6149
redmass: 3.0685 2.0681 4.3355 3.6113 1.4456 6.8993 2.1830 3.5976 1.9512 1.1723 3.3419 1.4805 6.3659 8.0169 5.6470 1.1279 1.2542 3.1708 3.0346 3.1180 3.7082 1.0565 2.4278 1.9789 5.3489 2.4337 1.2457 1.1086 1.4814 1.5524 1.8366 2.4351 1.0833 1.0884 1.1150 1.7839 1.2091 12.1805 5.5443 1.0580 1.0593 1.1042 1.0622 1.1052 1.1077 1.0754 1.0459 1.1035
irintensity: 7.3498 1.5165 7.6715 2.4867 3.5275 0.9663 21.2676 0.9984 153.6864 152.9266 15.4567 126.8613 1.3313 15.6388 15.8409 12.2824 0.0004 0.1474 0.8096 3.9062 0.6274 0.6530 27.2261 0.0104 138.0015 20.9824 0.0221 0.0699 2.7603 8.5889 0.8509 366.5857 20.3787 4.3036 3.0107 338.3287 124.2174 21.9401 325.9021 22.2660 22.0254 17.5637 52.6180 6.0699 42.9338 14.3057 39.4435 41.1452
temp: 298.150 k
press: 1.00000 atm
elementType: 8 7 7 7 6 6 6 6 6 1 1 1 1 1 1 1 1 1
symmnumber: 1
zpe: 377197.7 jmol-1
zpe.correction: 0.143667 hartree
zpe.thermalcorrener: 0.153345 hartree
zpe.thermalcorrenthalpy: 0.154289 hartree
zpe.thermalcorrgfe: 0.107599 hartree
zpe.sumelectzpe: -434.667992 hartree
zpe.sumelectthermal: -434.658314 hartree
zpe.sumelectthermalent: -434.657369 hartree
zpe.sumelectthermalfe: -434.704059 hartree
dipole: -2.1490 6.0004 -0.0130
dipole: 6.3736
quadrupole: -46.0301 -53.5238 -54.1725
quadrupole: 13.1167 -0.0139 -0.0114
quadrupole: 5.2120 -2.2816 -2.9304 13.1167 -0.0139 -0.0114
hfenergy: -434.8116587 hartree
pointgroup: C01 [X(C5H9N3O1)]
dipole: 0.8756937 2.3493414 0.0407466 debye
dipolederiv: -0.8519991 -0.1970467 -0.0106185 -0.3948433 -0.9902266 -0.0146121 -0.0127853 -0.0112794 -0.3745266 0.3732617 -0.1521962 0.0075574 -0.9886268 -0.1813071 -0.018034 -0.0009657 -0.0036256 -0.0802674 -1.7126002 -0.0786466 -0.0234847 0.3903683 -0.116549 0.009508 -0.0216709 0.0012302 -0.3767949 -1.0122834 0.4502964 0.0028871 0.634182 -0.7526957 0.0123928 0.0049999 0.0091513 -0.7992749 0.12166 0.0141021 0.0017837 -0.0009468 -0.0156056 -0.0002676 0.0001651 -0.0005337 0.1549079 -0.0521921 0.0123933 -0.0025839 0.1501862 -0.0528398 0.002835 -0.0031707 -0.0003531 0.1435582 -0.1256417 -0.0452156 -0.0039406 -0.0602367 -0.2093803 -0.0058363 -0.0064067 -0.0048374 0.2415004 0.1917167 0.11401 0.004163 0.0557035 0.4691821 0.0046384 0.0082712 0.0066844 -0.0919539 2.6422808 -0.1061649 0.0381869 0.2326309 1.5631678 0.0192414 0.0423564 0.0131003 0.3533782 -0.0483509 -0.0236176 -0.0973493 -0.0290454 0.0619049 -0.0276061 -0.1509296 -0.0371544 -0.0633131 -0.0493688 -0.024746 0.0963019 -0.0304068 0.0616029 0.0282055 0.150139 0.0379283 -0.0603898 0.0024317 0.0230238 -0.0201268 0.0311292 -0.0005631 0.0952206 -0.0638115 0.1252575 -0.0419896 0.0007155 0.0258311 0.0201385 0.0329238 -0.0008856 -0.0945641 0.0652683 -0.1248102 -0.0389271 0.0415048 0.0368521 -0.0521991 -0.0242453 -0.0200815 0.082494 -0.0038207 0.1229447 -0.0514821 0.0406209 0.0375776 0.0538891 -0.02424 -0.0144451 -0.0825479 0.0055313 -0.1209733 -0.0559382 0.0248965 -0.0165872 -0.006033 0.0845796 -0.0613006 -0.0026721 -0.0044703 -0.0043113 0.3287029 0.2266807 -0.0201524 -0.0036861 -0.0067116 0.1750629 -0.0032101 -0.0038876 -0.0032746 0.4054953 0.186667 -0.0497133 -0.0048855 -0.0524007 0.0849595 -0.0051855 -0.0048123 -0.0051435 0.4073147 unknown
polarizability: 125.685251|-2.3013068|78.4094936|1.3429869|0.2923156|46.0277796 unknown
InChI: InChI=1S/C5H9N3O/c6-5(9)8-7-4-2-1-3-4/h8H,1-3,6H2
charge 0 multiplicity 1
18 atoms
O  -2.739188 -1.187005 -0.074197
N  0.02254 -0.582048 -0.014211
N  -0.972651 0.389579 -0.023553
N  -3.20153 1.099087 -0.05441
C  3.343817 0.378532 0.035876
C  2.546723 -0.983057 0.024483
C  1.990488 1.188572 0.031217
C  1.256775 -0.169513 0.010428
C  -2.332786 0.001462 -0.052414
H  3.958901 0.537246 0.935326
H  3.966511 0.544615 -0.857054
H  2.682402 -1.613685 0.920596
H  2.703846 -1.614025 -0.867737
H  1.83232 1.825696 -0.860033
H  1.816116 1.804285 0.93453
H  -0.721605 1.38741 -0.008137
H  -4.195521 0.887243 -0.07631
H  -2.904058 2.072303 -0.035798
