program: Gaussian 09
title: 000277531
version: EM64L-G09RevD.01
frameworkgroup: C1[X(C14H8Cl2)]
method: RPBEPBE
basis: SDD
operation: Freq
keyword: #pfreq=noraman
keyword: PBEPBE/SDD
title: #p freq=noraman PBEPBE/SDD
converged: YES YES NO NO
title: Mulliken charges:
elementType: Cl Cl C C C C C C C C C C C C C C H H H H H H H H
charge: 0.047060 0.047200 0.131633 0.131437 0.120019 0.116926 0.677643 -0.400773 -0.400750 -0.362672 -0.360602 -0.237277 -0.237231 -0.251202 -0.252012 -0.716815 0.248165 0.248128 0.264666 0.264309 0.231501 0.231458 0.229592 0.229594
chargesum: 0.00000
title: Mulliken charges with hydrogens summed into heavy atoms:
elementType: Cl Cl C C C C C C C C C C C C C C
charge: 0.047060 0.047200 0.131633 0.131437 0.120019 0.116926 0.677643 -0.152607 -0.152622 -0.098006 -0.096292 -0.005776 -0.005772 -0.021610 -0.022419 -0.716815
polarizability: 2.28952396e+02 2.00656985e-01 2.49648585e+02 -4.82120712e-03 9.82667472e-03 6.16279360e+01
1716.lowfreq: -11.7771 0.0023 0.0030 0.0035 1.7615 5.9498 48.4247 62.8327 116.9326
frequency: 48.4129 62.8314 116.9325 138.8916 157.0203 207.2729 251.0987 253.8407 287.5754 326.4508 368.2939 416.7210 422.0496 454.4971 457.2650 508.8501 566.3620 600.7975 619.7750 631.4266 640.1880 734.5444 741.9907 755.9281 780.6136 787.9031 794.3558 813.4547 878.2484 887.6850 916.7931 954.1593 954.6393 988.6755 990.5166 996.8261 1032.1755 1040.3848 1089.4733 1116.0776 1157.0917 1169.1172 1184.3127 1204.5213 1247.6664 1301.4447 1310.0481 1375.1688 1403.6399 1436.5628 1444.5018 1464.2394 1479.8240 1583.8569 1585.1410 1589.7603 1611.1079 1626.4911 3128.7272 3130.0333 3141.7376 3143.4077 3161.2205 3162.0341 3198.7103 3199.9656
redmass: 17.4858 4.5443 5.4863 3.6811 11.4404 6.0279 13.2589 10.3468 4.3208 7.0500 17.3527 3.1372 6.7159 5.6316 3.0556 5.2970 3.2797 8.2191 6.8616 4.5517 7.8621 5.6864 1.9144 1.4802 2.0584 9.6275 2.3865 7.4415 1.3527 1.6167 7.8606 1.4186 1.4284 1.3525 1.3333 7.3198 2.3941 1.8905 2.8315 1.8573 1.8529 1.2170 1.1927 1.9404 1.9400 1.5328 1.8886 8.8026 3.2615 2.2610 2.7619 2.5619 4.2103 7.0842 6.6952 7.8970 7.3771 7.7728 1.0860 1.0858 1.0915 1.0916 1.0984 1.0984 1.0935 1.0935
irintensity: 0.0001 0.1488 2.8631 0.0002 0.2004 0.9683 0.4754 0.6008 0.0000 0.2017 5.3479 5.1517 0.0081 3.0382 0.0013 0.6291 0.0000 4.4339 6.0923 15.4585 28.4309 5.5119 107.7638 0.0076 75.4960 99.6839 0.0018 18.1638 0.0511 0.0000 26.4900 4.1209 1.6121 0.0002 0.0052 1.0788 1.4099 11.1463 0.3176 1.1413 8.5115 0.2000 2.9622 1.6323 3.1134 1.0770 0.5003 2.7053 0.0638 30.8969 25.0570 8.2142 1.4352 16.5190 0.8902 54.5429 4.1707 45.3989 2.8162 0.0117 10.9280 14.2005 39.7641 27.7588 10.7503 3.0993
temp: 298.150 k
press: 1.00000 atm
elementType: 17 17 6 6 6 6 6 6 6 6 6 6 6 6 6 6 1 1 1 1 1 1 1 1
symmnumber: 1
zpe: 449983.3 jmol-1
zpe.correction: 0.171390 hartree
zpe.thermalcorrener: 0.183889 hartree
zpe.thermalcorrenthalpy: 0.184834 hartree
zpe.thermalcorrgfe: 0.131577 hartree
zpe.sumelectzpe: -1457.329312 hartree
zpe.sumelectthermal: -1457.316813 hartree
zpe.sumelectthermalent: -1457.315868 hartree
zpe.sumelectthermalfe: -1457.369125 hartree
dipole: -1.9157 0.0141 0.0001
dipole: 1.9158
quadrupole: -97.1457 -90.7759 -111.8885
quadrupole: 0.0602 -0.0003 0.0011
quadrupole: 2.7910 9.1608 -11.9518 0.0602 -0.0003 0.0011
hfenergy: -1457.500702 hartree
pointgroup: C01 [X(C14H8Cl2)]
dipole: 0.0012363 0.7537248 -0.0000287 debye
dipolederiv: -0.562395 -0.4559532 -0.0000158 -0.2797484 -0.4630317 0.0000004 -0.000023 -0.000013 0.0206882 -0.559901 0.457394 -0.0000452 0.2809513 -0.4669656 0.0000302 -0.0000361 0.0000337 0.0209975 0.2190603 0.2567642 0.0000049 -0.0546122 -0.0535927 -0.0000022 0.0000193 0.0000195 0.0136281 0.2174968 -0.2565545 0.0000197 0.0547864 -0.0537272 0.0000062 0.0000121 -0.0000104 0.0134548 -0.1728774 0.2527612 -0.000019 0.1713112 0.1657225 0.0000001 -0.0000173 -0.0000034 -0.0212891 -0.1734199 -0.2536274 -0.0000003 -0.1704723 0.1646458 -0.0000154 -0.0000043 -0.0000179 -0.0215604 0.0145581 0.0008573 -0.0000042 -0.0003976 -0.4351569 0.0000172 -0.0000039 0.0000164 0.1130068 -0.1623007 -0.210498 0.0000064 -0.0713939 0.0508102 -0.0000077 -0.0000017 -0.0000168 -0.1617871 -0.1616472 0.2105011 -0.0000073 0.0708117 0.0509511 -0.0000035 -0.0000048 0.0000038 -0.1618304 0.0095919 -0.1123119 0.0000123 -0.0968616 -0.0087365 -0.0000049 0.0000102 -0.0000061 -0.1387749 0.0088215 0.1126314 0.0000046 0.0966507 -0.0096465 0.0000022 0.0000055 0.0000026 -0.1386744 0.0391309 0.1458107 0.0000052 0.1196141 -0.0344308 0.0000071 0.0000089 0.0000073 -0.1476912 0.0388487 -0.1458874 0.0000146 -0.1198827 -0.034819 -0.0000105 0.0000146 -0.0000134 -0.1476452 0.0402332 -0.0001173 0.0000084 -0.0768842 0.0049881 -0.0000077 0.0000096 -0.0000024 -0.1683859 0.0405644 0.0000147 0.0000114 0.07747 0.0051909 -0.0000019 0.0000074 -0.0000064 -0.1684198 1.1510956 -0.00153 0.0000693 -0.0008537 1.1999347 -0.0000431 0.0000686 -0.0000292 -0.1809959 0.0670813 0.0917588 -0.0000063 0.0415628 -0.0753215 0.0000069 -0.0000064 0.0000111 0.1552106 0.0671925 -0.0916873 -0.0000016 -0.041496 -0.0755372 0.0000055 -0.0000033 0.000002 0.1552552 0.0932825 0.0300882 -0.000004 0.0827567 -0.0087078 0.0000064 -0.0000057 0.0000059 0.1606871 0.0938413 -0.0303572 -0.000003 -0.0831393 -0.0072332 0.0000006 -0.000001 0.0000026 0.1608 -0.0221647 -0.1067341 -0.0000075 -0.1248579 -0.0360619 -0.000003 -0.0000067 -0.0000026 0.1596358 -0.0223527 0.1067755 -0.0000134 0.124921 -0.0359896 0.0000133 -0.0000138 0.0000133 0.1596092 -0.1318861 0.0131279 -0.0000139 0.0399952 0.0783722 0.0000031 -0.0000138 0.000001 0.1620523 -0.1318541 -0.0132265 -0.0000152 -0.0402314 0.0783427 0.0000005 -0.0000142 0.0000024 0.1620286 unknown
polarizability: 249.6505197|0.0146373|228.9504612|0.009783|-0.0049093|61.627936 unknown
InChI: InChI=1S/C14H8Cl2/c15-14(16)13-11-7-3-1-5-9(11)10-6-2-4-8-12(10)13/h1-8H
charge 0 multiplicity 1
24 atoms
Cl -1.487433 -3.520803 0.000303
Cl 1.480282 -3.5276 0.000455
C  0.735356 1.136978 0.000279
C  -0.734709 1.136712 0.000193
C  1.1993 -0.220112 0.000326
C  -1.197951 -0.220435 0.000215
C  0.000563 -1.122352 0.000303
C  1.637422 2.217443 0.000305
C  -1.637517 2.21655 0.000108
C  2.588613 -0.4766 0.000394
C  -2.586923 -0.478205 0.000148
C  3.026347 1.950102 0.000378
C  -3.026295 1.948159 0.000044
C  3.492987 0.614028 0.000423
C  -3.492098 0.611744 0.000063
C  -0.001237 -2.489814 0.000351
H  1.272834 3.250378 0.000263
H  -1.27365 3.249739 0.000095
H  2.982015 -1.493431 0.000431
H  -2.979208 -1.495598 0.000156
H  3.743751 2.777946 0.0004
H  -3.74428 2.775495 -0.000022
H  4.570235 0.415562 0.000478
H  -4.569204 0.412515 0.000012
