program: Gaussian 09
title: 000277543
version: EM64L-G09RevD.01
frameworkgroup: C1[X(C10H13Cl3N2)]
method: RPBEPBE
basis: SDD
operation: Freq
keyword: #p
keyword: freq=noraman
keyword: PBEPBE/SDD
title: #p freq=noraman PBEPBE/SDD
converged: YES YES NO NO
title: Mulliken charges:
elementType: Cl Cl Cl N N C C C C C C C C C C H H H H H H H H H H H H H
charge: 0.063842 0.056624 0.095930 -0.040664 -0.075864 0.175255 -0.188254 -0.214717 -0.570221 -0.672763 -0.347475 -0.269788 0.111027 -0.598072 -0.650702 0.248401 0.246605 0.233574 0.238807 0.230163 0.245078 0.228902 0.225612 0.225117 0.267000 0.238519 0.261072 0.236991
chargesum: 0.00000
title: Mulliken charges with hydrogens summed into heavy atoms:
elementType: Cl Cl Cl N N C C C C C C C C C C
charge: 0.063842 0.056624 0.095930 -0.040664 -0.075864 0.175255 0.060147 0.031888 -0.570221 0.029781 -0.102397 -0.040886 0.111027 0.119657 0.085881
polarizability: 2.88870148e+02 1.29408392e+01 1.36650166e+02 -2.35613005e+01 7.66265098e+00 1.14174260e+02
1716.lowfreq: -7.3284 0.0009 0.0010 0.0019 4.8863 7.2995 16.5081 38.0131 53.0130
frequency: 16.3970 37.9039 52.9596 65.2727 129.6888 154.2475 159.4804 180.6072 194.2709 202.0750 225.4880 235.5967 258.9842 261.1264 278.5262 291.9627 310.1397 349.7550 369.5279 372.8205 403.4079 448.7010 474.9788 493.4327 587.6405 608.6938 653.7462 688.2740 717.2949 750.9023 762.0630 765.9911 798.6154 840.6764 895.8085 937.1738 947.8885 959.7365 975.0675 1031.6851 1052.6792 1071.7327 1080.8887 1111.1310 1114.1223 1119.5459 1206.5029 1243.0516 1268.8351 1285.7180 1305.0196 1371.4400 1382.1282 1401.8367 1417.0040 1428.1999 1464.3144 1464.7098 1470.7643 1474.2355 1478.0103 1489.2449 1539.4792 1595.6458 1652.9725 2954.2986 2961.7628 2997.0934 3034.7158 3045.5712 3089.9031 3102.7122 3106.6500 3126.8660 3130.7269 3135.2706 3158.9481 3179.1599
redmass: 4.3880 2.9709 9.5132 1.6555 3.3552 5.3759 3.2008 7.0798 1.7626 2.0512 1.9732 2.7932 9.2199 3.2298 3.6402 2.6878 2.9966 8.0577 4.2804 3.4050 4.6290 2.8702 3.4864 3.4176 6.1296 5.2269 4.0001 7.6108 8.2112 4.0113 4.2340 1.6747 1.8346 4.7817 2.7278 3.2655 1.5170 1.3173 1.2871 1.5788 2.3437 4.1512 1.2399 2.2047 1.4815 1.3316 1.1504 3.3310 2.0354 2.2423 1.9882 1.2514 2.2137 1.7340 1.1422 1.2486 1.0536 1.0538 1.0548 1.0661 1.0731 1.0881 4.5447 8.2647 7.2507 1.0380 1.0372 1.0339 1.0986 1.0998 1.0998 1.1005 1.1005 1.0870 1.0854 1.0966 1.0981 1.0931
irintensity: 1.2472 0.8592 0.2016 4.3567 0.7592 0.7301 1.9931 1.1196 2.2755 7.2381 1.0945 1.7115 0.9808 2.1279 4.4103 5.0178 3.7541 9.2051 3.0530 11.9828 18.3945 2.8953 23.4126 3.0909 11.9112 10.4630 45.5006 139.8553 134.9497 12.2780 26.2983 14.1991 109.8851 12.4793 63.1916 9.9688 3.2103 4.7848 0.9756 6.7914 151.7421 6.7638 2.3588 39.3635 4.2817 2.5385 9.7571 1.6511 12.6509 31.3274 7.7838 52.3202 15.6625 60.5642 13.1659 30.8828 31.8293 12.4871 7.5784 5.1854 15.1827 1.5157 315.4746 14.4650 47.5483 89.2034 111.6297 20.6424 43.0448 24.1953 24.5076 10.1396 19.1106 3.5044 0.3680 7.3694 15.9965 12.3404
temp: 298.150 k
press: 1.00000 atm
elementType: 17 17 17 7 7 6 6 6 6 6 6 6 6 6 6 1 1 1 1 1 1 1 1 1 1 1 1 1
symmnumber: 1
zpe: 552683.7 jmol-1
zpe.correction: 0.210506 hartree
zpe.thermalcorrener: 0.227403 hartree
zpe.thermalcorrenthalpy: 0.228347 hartree
zpe.thermalcorrgfe: 0.164467 hartree
zpe.sumelectzpe: -1877.324261 hartree
zpe.sumelectthermal: -1877.307365 hartree
zpe.sumelectthermalent: -1877.306420 hartree
zpe.sumelectthermalfe: -1877.370300 hartree
dipole: 5.2134 1.2515 1.6319
dipole: 5.6044
quadrupole: -94.0227 -106.8227 -111.1775
quadrupole: 9.6791 -5.1456 1.8082
quadrupole: 9.9849 -2.8151 -7.1699 9.6791 -5.1456 1.8082
hfenergy: -1877.5347673 hartree
pointgroup: C01 [X(C10H13Cl3N2)]
dipole: 2.1133487 -0.259833 0.5726963 debye
polarizability: 287.6574037|23.8244249|113.8998307|-18.6949046|6.3851968|138.137339 unknown
InChI: InChI=1S/C10H13Cl3N2/c1-9(10(11,12)13)6-4-8(5-7-9)14-15(2)3/h4-7H,1-3H3
charge 0 multiplicity 1
28 atoms
Cl -4.022195 0.216375 -0.800376
Cl -3.37018 1.020466 2.049597
Cl -1.770507 2.159783 -0.252627
N  2.544199 -0.164106 -0.793734
N  3.646881 0.328856 -0.1740
C  -1.58577 -0.596302 0.479135
C  -1.014884 -0.892235 -0.902759
C  -0.480392 -0.227548 1.461009
C  -2.599128 0.608266 0.37336
C  -2.339857 -1.859668 1.009038
C  0.306714 -0.754321 -1.211236
C  0.83538 -0.073973 1.119794
C  1.313603 -0.279076 -0.255812
C  4.866825 0.315173 -0.997247
C  3.695767 1.070332 1.101856
H  -1.726748 -1.251336 -1.65415
H  -0.788931 -0.115527 2.507201
H  -3.143994 -2.163809 0.317291
H  -1.609378 -2.682356 1.082543
H  -2.777381 -1.681829 2.006521
H  0.673389 -0.993582 -2.21563
H  1.540606 0.146655 1.924611
H  5.70694 -0.146076 -0.4445
H  5.164564 1.340348 -1.297874
H  4.656941 -0.277863 -1.898172
H  3.69424 0.398415 1.98218
H  2.83873 1.76489 1.177345
H  4.625765 1.662648 1.126134
