program: Gaussian 09
title: 000275730
version: EM64L-G09RevD.01
frameworkgroup: C1[X(C13H9FO2)]
method: RPBEPBE
basis: SDD
operation: Freq
keyword: #p
keyword: freq=noraman
keyword: PBEPBE/SDD
title: #p freq=noraman PBEPBE/SDD
converged: YES YES NO NO
title: Mulliken charges:
elementType: F O O C C C C C C C C C C C C C H H H H H H H H H
charge: -0.198629 -0.240467 -0.257284 0.308083 0.107536 -0.305242 -0.322981 0.347408 -0.286592 -0.271523 -0.388776 -0.374424 0.329341 -0.381333 -0.251839 -0.159428 0.229484 0.286702 0.237784 0.281579 0.258270 0.260239 0.266206 0.260023 0.265861
chargesum: 0.00000
title: Mulliken charges with hydrogens summed into heavy atoms:
elementType: F O O C C C C C C C C C C C C C
charge: -0.198629 -0.240467 -0.257284 0.308083 0.107536 -0.075758 -0.036278 0.347408 -0.048808 0.010056 -0.130505 -0.114185 0.329341 -0.115127 0.008184 0.106433
polarizability: 3.24686429e+02 1.00582901e+01 1.50770139e+02 1.21408528e-01 8.11211096e-03 5.68665306e+01
1716.lowfreq: -7.5564 -3.0308 -0.0008 -0.0006 -0.0004 3.6921 19.8551 38.4914 50.9191
frequency: 19.6915 38.4903 50.9173 98.9394 104.5399 164.8648 176.2598 222.8976 281.6932 305.6078 331.6024 369.1363 410.4887 418.1776 494.3834 518.5698 575.4692 584.6445 625.3334 632.7822 682.7547 690.5323 743.4921 748.6396 792.6033 816.3590 820.8242 850.2482 852.0530 868.8216 875.8205 884.0258 891.4684 949.2418 991.6731 993.8718 1001.7277 1019.9796 1026.2116 1056.2701 1106.1797 1133.8198 1156.2499 1183.1805 1202.0150 1223.7609 1256.7002 1277.0608 1293.3042 1327.3591 1370.8397 1379.3878 1409.0160 1465.9166 1491.0381 1514.5728 1543.6823 1595.5354 1606.3175 1647.0487 3121.3936 3156.1464 3158.3435 3169.7481 3178.3179 3182.6729 3221.5690 3236.4040 3266.9943
redmass: 3.9015 5.0999 6.5654 6.4545 8.2579 6.4694 3.6171 7.6248 8.5607 5.4396 3.3166 8.7588 2.9177 5.5868 2.9943 4.6635 8.1857 2.9413 7.2172 3.8259 4.2443 6.7292 1.2648 3.4179 6.3466 1.2983 1.3560 4.7319 1.5635 6.6245 4.5542 1.7096 1.5755 1.3850 1.1578 1.3429 3.1849 1.7092 2.5226 2.6005 1.3241 1.5967 1.4178 1.5700 2.1512 2.2877 2.3552 1.4984 1.9685 1.6770 2.7669 5.1232 4.1719 4.8855 2.6943 10.3135 5.4956 7.6956 6.4034 6.6675 1.0902 1.0895 1.0889 1.0895 1.0963 1.0965 1.0927 1.0978 1.1086
irintensity: 0.0210 0.9720 0.3127 0.2949 5.3827 1.8761 0.1976 2.7879 6.4285 0.0011 5.0208 1.8190 0.0015 7.8563 12.1897 4.3324 56.6544 9.6951 1.6448 6.6487 5.3942 17.7653 86.3695 6.7326 12.9272 27.6613 25.8911 9.7175 62.8850 14.6979 11.6304 0.8303 2.5901 2.9760 44.0467 6.3918 35.9866 14.3097 99.7115 13.6916 17.9577 2.5896 129.4972 14.9476 8.0037 165.4862 61.9334 83.5305 137.5766 74.1531 29.4204 35.1107 7.2408 34.3308 43.5570 198.5265 69.6149 34.2282 211.1129 270.5886 0.6195 3.8635 0.1775 6.5393 8.4472 5.7722 3.6107 1.0262 0.0042
temp: 298.150 k
press: 1.00000 atm
elementType: 9 8 8 6 6 6 6 6 6 6 6 6 6 6 6 6 1 1 1 1 1 1 1 1 1
symmnumber: 1
zpe: 477643.0 jmol-1
zpe.correction: 0.181925 hartree
zpe.thermalcorrener: 0.195283 hartree
zpe.thermalcorrenthalpy: 0.196227 hartree
zpe.thermalcorrgfe: 0.139406 hartree
zpe.sumelectzpe: -749.929219 hartree
zpe.sumelectthermal: -749.915861 hartree
zpe.sumelectthermalent: -749.914917 hartree
zpe.sumelectthermalfe: -749.971738 hartree
dipole: -4.0971 -2.1779 0.0010
dipole: 4.6399
quadrupole: -75.1244 -88.5619 -96.3293
quadrupole: 5.7109 0.0389 0.0170
quadrupole: 11.5475 -1.8900 -9.6575 5.7109 0.0389 0.0170
hfenergy: -750.1111436 hartree
pointgroup: C01 [X(C13H9F1O2)]
dipole: -1.6154241 0.8459346 0.0849237 debye
dipolederiv: -1.2948699 -0.3514738 -0.0318719 -0.4758678 -0.3611279 -0.0199501 -0.0440605 -0.0201443 -0.1515845 -0.3625346 -0.2295754 -0.0204355 -0.2908911 -0.3706422 -0.0218109 -0.025972 -0.0221392 -0.127348 -0.9181818 -0.0666252 -0.0055848 0.3625265 -0.9689641 -0.0609892 0.0333708 -0.0600478 -0.3435919 -0.8653412 -0.1989981 -0.0174234 -0.2599864 -0.2155661 -0.0189313 -0.0242881 -0.0194684 -0.017007 2.6795978 0.0885018 0.004269 -0.4945326 0.9420768 0.074049 -0.0481999 0.0732995 0.1804523 0.1484563 0.0313054 0.0020129 0.2544195 0.1172503 0.0234133 0.0230427 0.023636 -0.1153804 0.2975078 0.0839051 0.007202 -0.13307 0.0625582 0.0169481 -0.0131784 0.0159652 -0.0977357 -0.6590203 0.2869618 0.0285171 0.2221423 0.2070994 0.0152821 0.022555 0.0152716 0.0356731 -1.85114 0.3132534 0.0330839 0.0151898 -0.0145281 0.0170309 0.0056244 0.0166766 -0.2065912 1.2945665 -0.2228583 -0.0245146 -0.0515727 0.1199723 0.0162607 -0.0082179 0.0165488 -0.0522575 -0.5147325 -0.084247 -0.0073111 0.1737754 0.025221 0.0187875 0.0195597 0.0194999 -0.1626189 -0.2045339 -0.1283882 -0.0130121 -0.4652091 -0.2093296 -0.0032389 -0.0471201 -0.0042197 -0.1629109 1.3715763 0.3584236 0.0319312 0.5020441 0.4976452 0.0381294 0.0461033 0.0384103 0.1101414 0.4158567 -0.174469 -0.0179146 -0.1724647 0.0917155 0.0257742 -0.0184185 0.0259162 -0.1776456 0.0738122 -0.0488245 -0.0054736 0.4688446 -0.2620688 -0.0064973 0.0428184 -0.0051248 -0.2058441 -0.2535344 0.2466682 0.0229837 0.1695371 0.1579664 0.0239587 0.0161632 0.023771 -0.1036633 0.007531 0.0927656 0.0101539 0.1321988 0.0399456 -0.011113 0.0137303 -0.0109307 0.1435275 0.1876408 -0.0353245 -0.0036478 0.0215556 0.0144624 -0.0143647 0.0013874 -0.013799 0.15229 0.1071694 -0.0151221 -0.0011491 0.0149915 -0.0587201 -0.0210582 0.0014977 -0.0210613 0.1698006 0.1119591 0.0034007 0.000539 -0.0210596 0.0114963 -0.0133765 -0.001568 -0.0136392 0.1569443 0.0737994 -0.0195444 -0.0015971 -0.0511702 -0.0372027 -0.0222191 -0.0047306 -0.0222317 0.1804522 -0.0321476 0.0571481 0.00658 0.0631575 0.0619715 -0.0123721 0.0071103 -0.0123943 0.1799313 0.1412125 -0.0063819 -0.0003549 -0.0161063 -0.0063515 -0.0190519 -0.0013631 -0.0190932 0.1976558 -0.0483318 0.0204769 0.0027244 0.0221964 0.1307554 -0.006733 0.0029065 -0.0067559 0.202002 0.0936822 -0.000978 0.0002937 0.0093512 0.0243648 -0.0179278 0.0012474 -0.0179456 0.2153087 unknown
polarizability: 324.7649992|-9.2362529|149.8066695|-1.5287578|9.0614832|57.7514303 unknown
InChI: InChI=1S/C13H9FO2/c14-11-5-3-10(4-6-11)13(15)8-7-12-2-1-9-16-12/h1-9H
charge 0 multiplicity 1
25 atoms
F  5.605384 1.255217 0.100308
O  -3.367997 1.215102 0.107883
O  0.332016 -2.362445 -0.238681
C  1.743052 -0.41743 -0.055728
C  0.397689 -1.09096 -0.117941
C  1.917306 0.986962 0.086533
C  2.89688 -1.245801 -0.143838
C  -3.335794 -0.200992 -0.024027
C  -0.831786 -0.269139 -0.038249
C  -2.06718 -0.868693 -0.089752
C  3.207386 1.554717 0.1399
C  4.192178 -0.699854 -0.093174
C  4.31568 0.695213 0.048398
C  -4.652257 -0.673526 -0.063322
C  -5.529188 0.462664 0.045186
C  -4.718101 1.585309 0.146565
H  1.055351 1.655845 0.158288
H  2.741964 -2.323919 -0.251904
H  -0.765746 0.817638 0.060803
H  -2.095529 -1.962079 -0.190352
H  3.358497 2.632302 0.24898
H  5.086787 -1.325372 -0.160066
H  -4.943623 -1.717975 -0.159302
H  -6.616992 0.453971 0.048094
H  -4.912479 2.649847 0.246099
