program: Gaussian 09
title: 000275729
version: EM64L-G09RevD.01
frameworkgroup: C1[X(C12H12O2)]
method: RPBEPBE
basis: SDD
operation: Freq
keyword: #pfreq=noraman
keyword: PBEPBE/SDD
title: #p freq=noraman PBEPBE/SDD
converged: YES YES NO NO
title: Mulliken charges:
elementType: O O C C C C C C C C C C C C H H H H H H H H H H H H
charge: -0.435154 -0.260441 -0.447158 -0.559750 -0.547008 0.258339 0.247383 -0.533406 -0.393871 0.528765 -0.412825 -0.275889 -0.317636 0.150592 0.228514 0.228872 0.233533 0.233683 0.234356 0.234199 0.240504 0.243041 0.236357 0.261733 0.247704 0.375562
chargesum: 0.00000
title: Mulliken charges with hydrogens summed into heavy atoms:
elementType: O O C C C C C C C C C C C C
charge: -0.059592 -0.260441 0.010228 -0.092534 -0.078453 0.258339 0.247383 -0.292902 -0.150830 0.528765 -0.176468 -0.014155 -0.069932 0.150592
polarizability: 2.59240811e+02 -1.15590048e+01 1.37711855e+02 -4.43821166e-02 -2.86582361e-02 6.55212967e+01
1716.lowfreq: -127.3671 -3.6112 -3.3389 0.0003 0.0005 0.0007 4.9231 41.9459 60.4625
frequency: -127.3524 41.8538 60.4585 78.0548 140.7993 180.3058 198.2107 199.8393 278.7024 337.6925 392.9121 418.7765 496.1340 507.6030 535.0126 564.6641 589.4715 615.4844 681.6656 683.6394 715.3521 744.3455 772.5288 796.7929 830.2682 880.6607 888.8871 908.7783 914.6075 924.7584 956.8120 961.5893 1013.5382 1032.1091 1039.6296 1050.0406 1107.6258 1143.8487 1151.0781 1199.5904 1199.8047 1217.8131 1227.5593 1236.7706 1247.6522 1283.8245 1291.9152 1303.7764 1319.9124 1342.3048 1389.3811 1439.1363 1454.1884 1461.2270 1487.2717 1493.4678 1578.4260 1613.0219 1631.8451 1647.7842 2984.3151 2987.4626 3024.0258 3026.3281 3032.3097 3082.0706 3098.5735 3122.1574 3131.3290 3145.4359 3165.1686 3526.1207
redmass: 1.5959 5.4459 5.3559 5.6131 3.1752 2.5218 7.8080 3.3075 5.9162 3.0073 4.2289 2.5760 5.4823 4.6944 2.3841 5.0496 1.3534 5.8072 3.1892 6.0273 2.2552 1.2972 5.4334 4.7355 1.3931 1.4573 1.7825 3.5332 1.5643 4.3069 3.1271 1.3535 1.2173 3.5150 1.7747 2.1518 3.0841 1.2013 1.6389 1.3343 1.2016 1.3862 1.4026 1.0694 1.7761 1.3798 2.2244 1.6110 1.4502 2.7526 4.2471 4.0878 1.1495 1.0891 1.1444 2.4194 6.6439 6.9693 7.8368 5.7381 1.0598 1.0598 1.0628 1.1018 1.1021 1.1048 1.0898 1.0874 1.0915 1.0971 1.0916 1.0640
irintensity: 0.5423 0.9798 0.0171 0.0710 0.6422 0.1364 1.7475 3.9257 0.3068 4.0367 7.9697 2.9908 37.2531 3.2190 6.2044 23.9210 131.3090 3.2978 36.7737 1.3195 2.6178 2.9898 5.2630 3.1713 49.3962 16.8109 0.0053 6.5035 1.6811 23.2978 1.3281 1.5669 45.4839 1.7278 3.7197 569.4129 0.0928 0.0029 3.7154 21.6141 0.0827 0.3350 2.0333 0.0397 22.0883 0.8911 14.3928 9.8282 3.1382 47.9369 65.6279 20.6644 6.7539 12.6809 19.0318 25.3841 12.5700 322.3307 296.7982 126.4477 28.9056 25.5685 71.2456 14.9324 2.2281 46.8398 2.3963 8.1297 10.1638 18.2200 8.8856 53.1524
temp: 298.150 k
press: 1.00000 atm
elementType: 8 8 6 6 6 6 6 6 6 6 6 6 6 6 1 1 1 1 1 1 1 1 1 1 1 1
symmnumber: 1
zpe: 545655.6 jmol-1
zpe.correction: 0.207829 hartree
zpe.thermalcorrener: 0.219476 hartree
zpe.thermalcorrenthalpy: 0.220420 hartree
zpe.thermalcorrgfe: 0.168923 hartree
zpe.sumelectzpe: -613.927605 hartree
zpe.sumelectthermal: -613.915958 hartree
zpe.sumelectthermalent: -613.915014 hartree
zpe.sumelectthermalfe: -613.966511 hartree
dipole: -4.0557 -1.1015 0.0045
dipole: 4.2026
quadrupole: -77.2039 -78.0715 -84.6983
quadrupole: -6.6361 0.0053 0.0062
quadrupole: 2.7873 1.9197 -4.7071 -6.6361 0.0053 0.0062
hfenergy: -614.135434 hartree
pointgroup: C01 [X(C12H12O2)]
dipole: -1.5919393 -0.4467122 -0.0041972 debye
dipolederiv: -0.9571975 0.5832377 -0.0149831 0.7926628 -0.9865017 0.0165995 -0.0189834 0.014926 -0.4391533 -1.1703881 -0.187993 -0.0031811 -0.4781593 -0.8159378 0.0050729 0.0020378 0.0073648 -0.3386542 0.0956419 0.0496877 -0.0021521 0.0650056 0.0166128 0.0021545 -0.0006528 0.0029397 0.1536946 0.0221831 -0.0064369 -0.0012477 -0.1077696 -0.0392904 0.0027011 0.0016715 0.0038608 0.1593951 -0.1728736 -0.0485758 -0.0015704 0.1322465 0.0443487 0.0024843 -0.0017754 0.0013102 0.1579663 -0.3138158 0.1943762 -0.0055499 0.5685095 0.1853732 0.0009392 -0.0127064 -0.0031341 -0.0396593 0.4651323 0.023757 0.0034563 -0.2204802 -0.1163265 -0.0008419 0.0046737 0.0012094 -0.0429349 0.13005 -0.1396055 0.0043601 0.0963657 -0.0227676 -0.0011755 0.0002417 -0.0029391 -0.1513008 -0.2366024 -0.1061801 0.0009244 -0.2757711 0.1180065 -0.0065261 0.0039635 -0.0051265 -0.1493531 -0.6128313 0.0296477 -0.0056721 -0.1258313 -0.0213818 0.0000953 -0.001989 0.0013205 0.0373489 0.1150313 0.0403846 0.0015146 -0.1443333 0.0396632 -0.0047306 0.0050854 -0.0032565 -0.1700896 1.2194435 -0.1128223 0.0125146 -0.3876087 0.17011 -0.0077356 0.0170779 -0.0054587 -0.0827415 -1.5396449 0.2298458 -0.0150625 0.5521809 -0.0505006 0.0016659 -0.0204457 -0.0008975 -0.1946789 2.6726203 -0.3871033 0.0267945 -0.0243207 1.3627476 -0.0212654 0.0204762 -0.024142 0.2341083 -0.0379156 -0.046414 0.0887508 -0.0562063 0.0376522 0.0476633 0.1548863 0.0747953 -0.0604654 -0.0290086 -0.0452487 -0.0859558 -0.0573299 0.0345101 -0.0512242 -0.1526923 -0.0785483 -0.0651079 0.0083583 0.0012467 0.0316749 -0.0130949 -0.0320648 -0.0921625 -0.0039573 -0.1409718 -0.0375783 0.0082911 -0.004036 -0.0303921 -0.0152455 -0.0227566 0.0912391 0.0051189 0.1402302 -0.0479968 -0.0473554 0.0328327 0.0637702 -0.0129111 0.0063311 -0.0745833 0.1302089 -0.0904431 -0.038392 -0.0439815 0.0303085 -0.0648348 -0.0158277 0.0097694 0.073311 -0.1306922 0.0895271 -0.0441518 0.0508114 0.0789541 -0.0018972 0.0662557 -0.0408792 0.0033252 -0.0019 0.0033678 0.1378149 0.0155335 0.0993471 -0.0026957 0.0928474 -0.0624895 0.0042121 -0.0027679 0.004294 0.1502032 0.0199236 -0.1136175 0.0008584 -0.077825 -0.0374156 0.0025489 0.0002068 0.002317 0.1539301 0.0652325 -0.02512 -0.0001943 -0.0704449 -0.0263459 0.0025629 0.0001761 0.0029212 0.1484199 0.0545796 -0.0653379 0.00027 -0.0943506 -0.0253314 0.002936 0.0006616 0.0031548 0.1726869 0.2187825 -0.1051349 0.0005001 -0.1885639 0.2748647 0.0007337 0.0020761 0.0013788 0.3966894 unknown
polarizability: 259.4114777|-10.521058|137.5050919|1.7487675|-1.3003415|65.5573935 unknown
InChI: InChI=1S/C12H12O2/c13-12(14)7-5-9-4-6-10-2-1-3-11(10)8-9/h4-8,13H,1-3H2
charge 0 multiplicity 1
26 atoms
O  4.803777 -1.44914 0.053093
O  4.701024 0.877557 0.009091
C  -4.225525 -1.196419 -0.034308
C  -2.793665 -1.837168 -0.004703
C  -4.037976 0.361152 -0.049646
C  -1.832353 -0.658164 -0.017159
C  -2.534632 0.577394 -0.042457
C  -0.428234 -0.683795 -0.005766
C  -1.822666 1.796319 -0.056858
C  0.307616 0.539475 -0.019938
C  -0.412552 1.771154 -0.045728
C  1.772341 0.594124 -0.009043
C  2.646145 -0.461247 0.01712
C  4.097745 -0.227134 0.02468
H  -4.812004 -1.509973 0.846315
H  -4.783436 -1.530112 -0.926046
H  -2.6254 -2.498786 -0.875467
H  -2.645848 -2.462498 0.896149
H  -4.513631 0.839284 0.828139
H  -4.503053 0.82061 -0.942864
H  0.101907 -1.643035 0.013481
H  -2.355398 2.753861 -0.076732
H  0.15119 2.71203 -0.056936
H  2.22408 1.597377 -0.023459
H  2.324131 -1.506435 0.033942
H  5.778618 -1.249529 0.057299
