program: Gaussian 09
title: 000275726
version: EM64L-G09RevD.01
frameworkgroup: C1[X(C23H18O)]
method: RPBEPBE
basis: SDD
operation: Freq
keyword: #pfreq=noraman
keyword: PBEPBE/SDD
title: #p freq=noraman PBEPBE/SDD
converged: YES YES NO NO
title: Mulliken charges:
elementType: O C C C C C C C C C C C C C C C C C C C C C C C H H H H H H H H H H H H H H H H H H
charge: -0.456955 -0.102050 0.374061 0.367063 0.313509 -0.610884 -0.396492 0.366481 0.371669 -0.425159 -0.376273 -0.354960 -0.388292 -0.385622 -0.428565 -0.408240 -0.247856 -0.246903 -0.259070 -0.227813 -0.240546 -0.241258 -0.247020 -0.244054 0.272002 0.277468 0.235228 0.260661 0.252801 0.260852 0.286997 0.348785 0.241506 0.238896 0.227975 0.225118 0.230017 0.224960 0.230771 0.225953 0.227672 0.227567
chargesum: 0.00000
title: Mulliken charges with hydrogens summed into heavy atoms:
elementType: O C C C C C C C C C C C C C C C C C C C C C C C
charge: -0.108170 -0.102050 0.374061 0.367063 0.313509 -0.338883 -0.119024 0.366481 0.371669 -0.189932 -0.115613 -0.102159 -0.127440 -0.098625 -0.187059 -0.169343 -0.019881 -0.021785 -0.029053 -0.002853 -0.009775 -0.015305 -0.019348 -0.016487
polarizability: 3.17686890e+02 -1.43064618e+01 2.40071987e+02 7.86971703e+00 -1.85128024e+01 1.93232965e+02
1716.lowfreq: -9.9025 -2.9144 -0.0006 0.0004 0.0006 9.6368 18.5963 33.4090 43.1978
frequency: 17.4835 33.3579 43.1633 45.7392 68.7812 74.2304 139.5097 165.3703 187.4363 211.4640 242.2979 247.6928 263.4105 286.5180 293.8114 325.5512 332.5883 396.2034 402.0547 403.1486 406.6107 449.3835 483.2075 494.8141 512.3412 533.9425 561.4684 582.2144 615.3811 617.1300 622.9350 627.7193 670.6543 678.3111 706.0099 706.7464 756.8848 760.6222 761.8266 772.5341 788.7254 814.8966 837.1823 855.8622 861.0273 868.6796 889.7825 902.9219 922.2613 931.4683 935.8506 950.6994 963.7574 975.9689 981.3263 985.2040 986.0707 990.2998 990.6780 992.3076 998.4776 1000.1963 1023.1918 1028.8969 1030.1390 1085.9746 1086.9997 1120.5807 1145.1933 1154.3167 1161.5334 1171.4488 1172.4585 1173.9682 1190.7606 1195.8433 1198.4787 1234.3139 1257.3676 1276.9683 1291.1576 1318.8289 1324.8467 1347.5644 1377.5209 1381.0355 1408.9443 1422.4048 1431.9051 1433.9622 1436.0014 1462.5324 1480.0085 1481.7195 1510.1634 1580.7062 1588.5152 1591.5913 1602.5640 1609.0183 1612.1943 1638.9965 3114.4522 3118.4315 3122.6877 3123.2672 3125.0785 3127.7945 3128.8329 3132.8524 3140.5470 3141.2629 3145.7967 3154.9648 3160.0896 3160.7065 3163.2703 3166.7152 3180.5051 3555.6806
redmass: 4.0488 4.1116 4.9245 4.2891 4.9078 4.5558 4.9865 4.8398 3.8609 4.1363 3.2833 4.7784 1.8943 2.6669 4.7726 4.6207 5.0060 3.4211 3.0363 2.9608 3.4817 4.7951 2.5434 3.7932 6.7768 3.7367 4.6106 5.0660 6.3056 6.3777 5.5813 6.5058 4.7178 3.7795 1.8016 1.7225 1.3676 4.7996 1.8701 1.9528 2.8306 4.8587 1.4108 1.2609 1.2560 1.7315 2.3708 3.5004 1.7842 1.5688 2.0566 2.7205 1.4011 3.8461 1.4078 1.3669 1.4401 5.5722 5.7684 1.3518 1.3235 1.3221 2.2626 2.2980 2.1800 1.6042 1.5931 1.8959 2.1827 1.6923 1.3322 1.0585 1.1003 1.0556 1.1415 1.1201 2.2850 2.4300 1.6632 1.8314 1.7317 1.3243 1.4243 1.7549 7.4134 8.9836 4.9048 3.1407 3.7330 2.2502 2.3109 2.4741 2.1812 2.2518 3.6196 7.1578 6.1021 6.3096 5.6171 6.0122 6.0905 6.7557 1.0869 1.0857 1.0846 1.0894 1.0891 1.0870 1.0901 1.0886 1.0925 1.0948 1.0938 1.0953 1.0992 1.1003 1.0952 1.0999 1.0950 1.0658
irintensity: 0.1051 0.1595 0.1169 0.1337 0.2070 0.2314 0.1243 0.4762 4.7338 6.7820 13.2790 1.7466 56.2950 89.0484 4.7750 35.1546 3.0908 1.2513 0.2295 0.3167 0.1049 6.7527 18.1095 1.8296 0.3099 2.1222 18.6928 6.2431 0.9819 0.2311 11.7420 1.9267 6.6030 5.5523 55.2513 52.0970 62.2059 0.6235 43.0676 56.2882 0.0037 10.0388 61.1957 2.9028 1.0884 45.0203 11.8039 17.7861 7.1106 2.6670 9.1637 10.8865 4.9583 11.2944 0.8451 0.7339 0.9138 0.9927 1.3988 0.1607 0.2122 0.3344 8.0692 4.3409 15.5855 3.8808 2.4465 13.8577 28.1288 19.7614 7.5593 0.6095 0.4160 0.1162 5.5021 6.7571 32.8576 1.8476 1.6577 9.5598 46.7026 13.3890 7.9801 7.8637 2.5359 2.4271 1.6908 0.4401 0.8510 15.0752 15.8118 0.2692 12.1974 25.1456 14.0365 0.4474 0.5775 0.2765 9.8691 5.9715 4.2492 2.7886 9.7741 2.5071 0.5917 0.9951 15.2474 1.5703 2.7250 9.1656 24.0323 32.3243 34.9465 23.6499 28.0417 39.1682 7.7637 19.0521 8.2040 10.2275
temp: 298.150 k
press: 1.00000 atm
elementType: 8 6 6 6 6 6 6 6 6 6 6 6 6 6 6 6 6 6 6 6 6 6 6 6 1 1 1 1 1 1 1 1 1 1 1 1 1 1 1 1 1 1
symmnumber: 1
zpe: 878823.1 jmol-1
zpe.correction: 0.334726 hartree
zpe.thermalcorrener: 0.353865 hartree
zpe.thermalcorrenthalpy: 0.354809 hartree
zpe.thermalcorrgfe: 0.285767 hartree
zpe.sumelectzpe: -960.844840 hartree
zpe.sumelectthermal: -960.825701 hartree
zpe.sumelectthermalent: -960.824756 hartree
zpe.sumelectthermalfe: -960.893799 hartree
dipole: -0.4903 1.4413 -0.6589
dipole: 1.6589
quadrupole: -128.3883 -129.5539 -133.7883
quadrupole: 0.6628 -3.1664 -0.7715
quadrupole: 2.1886 1.0229 -3.2115 0.6628 -3.1664 -0.7715
hfenergy: -961.1795659 hartree
pointgroup: C01 [X(C23H18O1)]
dipole: -0.0916682 0.4594609 -0.4543602 debye
polarizability: 310.7540872|-16.9167414|225.6915516|20.9030348|-32.680893|214.5462034 unknown
InChI: InChI=1S/C23H18O/c24-23(20-11-3-1-4-12-20,21-13-5-2-6-14-21)22-16-15-18-9-7-8-10-19(18)17-22/h1-17,24H
charge 0 multiplicity 1
42 atoms
O  1.270251 0.496441 2.298014
C  1.000246 0.139074 0.869717
C  -0.529068 0.127719 0.647533
C  1.739905 1.17847 -0.005851
C  1.563602 -1.287084 0.700867
C  -1.127046 0.508718 -0.557785
C  -1.357662 -0.369648 1.711325
C  -2.547267 0.429144 -0.745272
C  -3.376023 -0.062725 0.335589
C  -2.739591 -0.458438 1.559431
C  2.937796 0.872643 -0.695378
C  1.18968 -2.076655 -0.415392
C  1.265091 2.519253 -0.03465
C  2.495262 -1.809213 1.630154
C  -3.173061 0.823972 -1.974199
C  -4.795156 -0.139247 0.147543
C  3.641957 1.876457 -1.398842
C  1.738214 -3.364386 -0.600372
C  1.969291 3.523995 -0.73085
C  3.038902 -3.101843 1.449072
C  3.163874 3.205536 -1.418716
C  2.665935 -3.883974 0.332568
C  -4.55888 0.737885 -2.130663
C  -5.377338 0.252414 -1.060889
H  -0.512016 0.883983 -1.384115
H  -0.872833 -0.67288 2.644144
H  -3.360202 -0.838301 2.380076
H  3.322582 -0.15156 -0.683518
H  0.460803 -1.691225 -1.136646
H  0.326824 2.776736 0.473037
H  2.775793 -1.198417 2.491756
H  1.065819 1.460213 2.410349
H  -2.545667 1.197082 -2.792874
H  -5.419513 -0.511883 0.968622
H  4.565822 1.61882 -1.928867
H  1.436775 -3.963115 -1.467369
H  1.58518 4.550221 -0.741323
H  3.75431 -3.495528 2.180241
H  3.711932 3.982602 -1.963152
H  3.087335 -4.885944 0.192581
H  -5.026655 1.041933 -3.073576
H  -6.462805 0.189856 -1.196113
