program: Gaussian 09
title: 000275724
version: EM64L-G09RevD.01
frameworkgroup: C1[X(C20H13I)]
method: RPBEPBE
basis: SDD
operation: Freq
keyword: #pfreq=noraman
keyword: PBEPBE/SDD
title: #p freq=noraman PBEPBE/SDD
converged: NO NO NO NO
title: Mulliken charges:
elementType: I C C C C C C C C C C C C C C C C C C C C H H H H H H H H H H H H H
charge: 0.087130 -0.782740 -0.782500 0.408727 0.435124 0.412090 0.412096 0.413581 0.413582 -0.370510 -0.454466 -0.455870 -0.455874 -0.456512 -0.456513 -0.365440 -0.169597 -0.236738 -0.236735 -0.236611 -0.236614 0.248914 0.248378 0.259198 0.246007 0.240768 0.240769 0.240184 0.240184 0.246373 0.226005 0.226004 0.225804 0.225804
chargesum: 0.00000
title: Mulliken charges with hydrogens summed into heavy atoms:
elementType: I C C C C C C C C C C C C C C C C C C C C
charge: 0.087130 -0.533826 -0.534122 0.408727 0.435124 0.412090 0.412096 0.413581 0.413582 -0.111312 -0.208459 -0.215103 -0.215105 -0.216328 -0.216329 -0.365440 0.076776 -0.010733 -0.010731 -0.010808 -0.010810
polarizability: 2.80933664e+02 3.19716853e-04 2.05451503e+02 1.28576164e+01 5.04406179e-03 2.04177404e+02
1716.lowfreq: -6.0160 -3.5810 -0.0003 -0.0002 0.0006 9.6349 32.0368 59.5934 98.1848
frequency: 31.9926 59.5930 98.1836 107.6239 137.2130 149.7579 177.0674 194.4247 235.7553 249.0945 347.0126 365.1442 368.5928 381.8923 395.6805 419.6799 477.9337 483.4383 498.2926 504.8071 533.7486 602.5978 607.0687 625.8621 629.6181 649.7377 692.2546 730.2162 749.6288 750.4709 770.8678 777.7964 779.1702 796.7612 801.7599 825.8145 855.2095 861.3367 878.4501 898.8103 900.1177 905.5699 939.5001 943.4564 949.9484 982.9643 983.3332 1023.1350 1023.2003 1054.3739 1079.9578 1087.4626 1120.7616 1150.9591 1153.5482 1158.9052 1169.7660 1171.4387 1183.7674 1185.0076 1195.2834 1196.0410 1213.2231 1213.4892 1215.3669 1275.9845 1300.5418 1312.3138 1374.3868 1391.9405 1392.2991 1398.0235 1443.3886 1444.9534 1448.1664 1455.9865 1479.6607 1577.6564 1594.9532 1596.5445 1600.9200 1608.6914 1621.3354 3066.7279 3071.4319 3120.8592 3121.1121 3127.0156 3127.3219 3133.6889 3140.8417 3141.1535 3151.9094 3160.9181 3161.2733 3165.0164
redmass: 7.6135 5.5574 5.2573 6.5845 3.8650 4.4660 4.7614 8.7819 6.1027 5.1581 4.0174 4.1114 4.3411 5.5888 4.6306 2.9699 4.0732 4.3373 5.6223 4.9782 4.5075 4.2025 4.3009 5.5634 5.1307 6.7161 6.7579 4.7973 1.7435 1.4843 4.2873 2.2342 4.1371 3.1669 3.3657 1.5219 2.1071 1.8118 1.5017 2.5129 2.2556 5.1627 1.4029 1.4212 1.3734 1.3190 1.3185 2.3814 2.2697 2.3912 2.6566 2.8897 2.0391 2.1442 2.0489 2.4531 1.1363 1.0924 1.8429 1.6377 1.2664 1.2441 2.0115 1.9883 2.3836 1.3246 1.3637 1.3586 5.7740 6.9648 4.6769 5.1983 2.3730 2.3730 2.3143 2.2915 3.0866 7.2957 6.2064 7.3677 7.2092 7.0576 7.4018 1.0879 1.0893 1.0858 1.0857 1.0898 1.0899 1.0896 1.0940 1.0941 1.0928 1.1004 1.1003 1.0959
irintensity: 0.0623 0.7069 0.2965 0.0410 0.0012 0.0205 0.1642 0.0946 1.1316 0.3499 2.9879 0.0857 0.0003 2.2816 0.4146 0.1606 12.8261 13.9721 0.5428 16.8321 3.0033 9.0696 10.2620 19.8416 14.1931 0.4729 12.8232 0.2262 65.9556 30.7049 0.1365 0.0525 2.8071 20.0862 9.9412 25.4242 20.6635 4.3186 8.1690 16.4866 1.4121 5.7047 0.6296 1.5611 0.0640 0.0005 0.0156 3.1003 7.8126 17.2584 0.0014 5.9341 13.4328 0.0040 7.6298 16.4539 0.2122 0.0862 0.4672 0.3519 0.3460 0.0330 21.2039 10.4650 8.4436 3.9115 0.9380 0.0024 0.8449 0.3435 11.6027 8.3459 12.9408 0.0001 90.0482 38.7227 0.2569 13.4073 1.0776 16.8646 0.4682 0.0015 2.3307 31.8887 0.2885 0.0142 6.0713 3.3156 0.9778 6.1191 0.0255 56.5325 3.1968 55.6847 22.4442 6.9652
temp: 298.150 k
press: 1.00000 atm
elementType: 53 6 6 6 6 6 6 6 6 6 6 6 6 6 6 6 6 6 6 6 6 1 1 1 1 1 1 1 1 1 1 1 1 1
symmnumber: 1
zpe: 686105.9 jmol-1
zpe.correction: 0.261324 hartree
zpe.thermalcorrener: 0.276575 hartree
zpe.thermalcorrenthalpy: 0.277519 hartree
zpe.thermalcorrgfe: 0.217422 hartree
zpe.sumelectzpe: -780.051145 hartree
zpe.sumelectthermal: -780.035894 hartree
zpe.sumelectthermalent: -780.034950 hartree
zpe.sumelectthermalfe: -780.095047 hartree
dipole: 2.2934 0.0001 0.4184
dipole: 2.3313
quadrupole: -138.3983 -132.3235 -118.2101
quadrupole: -0.0012 2.7570 -0.0004
quadrupole: -8.7543 -2.6795 11.4339 -0.0012 2.7570 -0.0004
hfenergy: -780.3124692 hartree
pointgroup: C01 [X(C20H13I1)]
dipole: 0.8743555 0.0012157 -0.2770043 debye
polarizability: 276.5002596|0.1036772|205.4516546|-22.0441329|-0.027118|208.6106564 unknown
InChI: InChI=1S/C20H13I/c21-12-9-10-17-18(11-12)20-15-7-3-1-5-13(15)19(17)14-6-2-4-8-16(14)20/h1-11,19-20H
charge 0 multiplicity 1
34 atoms
I  -5.596626 -0.008068 1.041129
C  0.118327 0.000263 1.249418
C  0.437458 0.000667 -1.356423
C  -1.212521 -0.001589 0.479782
C  -1.040711 -0.001346 -0.932705
C  0.89389 -1.226515 0.738884
C  0.890552 1.229139 0.738856
C  1.06794 -1.226326 -0.673522
C  1.064608 1.22938 -0.673551
C  -2.496838 -0.003419 1.048073
C  -2.160944 -0.002877 -1.77876
C  1.409121 -2.274009 1.519719
C  1.402937 2.278062 1.519648
C  1.758383 -2.274101 -1.304669
C  1.752187 2.279004 -1.30474
C  -3.617718 -0.005006 0.180459
C  -3.468238 -0.004737 -1.221013
C  2.107565 -3.334537 0.884121
C  2.098495 3.340461 0.884007
C  2.280991 -3.334468 -0.517648
C  2.271918 3.340816 -0.51776
H  -0.016391 0.000089 2.343163
H  0.571744 0.00083 -2.450328
H  -2.628463 -0.003651 2.134256
H  -2.042024 -0.002697 -2.868087
H  1.276012 -2.276112 2.60792
H  1.269833 2.279855 2.60785
H  1.89463 -2.276616 -2.392493
H  1.888417 2.281852 -2.392565
H  -4.343304 -0.005975 -1.877364
H  2.512778 -4.155782 1.485786
H  2.501475 4.162824 1.485645
H  2.820763 -4.15581 -1.00217
H  2.809454 4.163601 -1.002318
