program: Gaussian 09
title: 000275722
version: EM64L-G09RevD.01
frameworkgroup: C1[X(C17H14)]
method: RPBEPBE
basis: SDD
operation: Freq
keyword: #p
keyword: freq=noraman
keyword: PBEPBE/SDD
title: #p freq=noraman PBEPBE/SDD
converged: YES YES NO NO
title: Mulliken charges:
elementType: C C C C C C C C C C C C C C C C C H H H H H H H H H H H H H H
charge: -0.074174 -0.640299 0.351774 0.351772 0.373850 0.373852 -0.211557 -0.208736 -0.860207 -0.419977 -0.419976 -0.457960 -0.457960 -0.248923 -0.248923 -0.236650 -0.236650 0.243990 0.244257 0.243042 0.222853 0.227777 0.227777 0.246432 0.246432 0.238698 0.238698 0.221893 0.221893 0.223501 0.223501
chargesum: 0.00000
title: Mulliken charges with hydrogens summed into heavy atoms:
elementType: C C C C C C C C C C C C C C C C C
charge: -0.074174 -0.396309 0.351774 0.351772 0.373850 0.373852 0.032700 0.034306 -0.181801 -0.173544 -0.173544 -0.219262 -0.219262 -0.027030 -0.027030 -0.013149 -0.013150
polarizability: 1.98328908e+02 -6.82809929e-05 1.73536262e+02 3.08151090e-05 -1.05355268e+01 1.28945882e+02
1716.lowfreq: -9.3898 -6.9029 -0.0005 -0.0005 0.0003 7.3302 68.6906 135.9954 156.4096
frequency: 68.6905 135.9949 156.4048 167.3870 234.0115 247.2428 267.5947 345.1448 347.0133 364.1736 401.6815 426.1018 429.8148 442.8567 498.8213 519.6228 545.2137 565.8662 585.0816 608.3645 615.7608 681.7575 684.2528 733.3341 748.3493 752.0582 764.7259 801.5345 801.8801 836.0284 844.0106 877.3356 883.7654 909.8559 921.2751 938.2564 939.5939 950.0187 980.0884 980.4674 1021.7493 1025.3125 1047.1542 1058.8623 1088.6825 1094.2696 1128.3165 1158.5453 1162.8466 1166.7035 1172.6741 1177.0054 1184.2325 1197.3769 1229.1018 1247.7446 1289.1912 1295.9191 1315.5712 1389.0275 1395.1820 1398.3143 1438.3643 1441.0999 1452.1549 1468.7333 1481.0195 1483.3065 1592.3257 1594.3997 1604.9955 1614.5054 1623.2394 2984.6012 3074.3645 3078.0892 3078.9682 3119.8744 3120.1287 3129.3530 3129.5626 3141.3251 3143.1564 3143.5219 3160.0599 3160.4774 3177.8668
redmass: 4.9364 3.7163 3.7838 4.1420 3.2323 2.5553 1.0702 3.3201 4.0132 3.2792 4.7833 3.2724 4.2749 3.1410 5.2458 4.1567 4.4041 3.8905 2.8192 4.5550 3.9697 5.6527 2.2280 5.6095 2.5208 1.6878 1.3314 2.1356 3.1770 2.9806 2.9302 1.4543 1.6051 3.2057 1.4625 1.4027 1.5482 2.0519 1.3129 1.3131 2.5082 2.5739 2.8884 2.4616 1.8919 1.3488 1.5685 1.8908 1.8647 1.3284 1.1779 2.3419 1.8024 1.5378 1.5523 2.8622 1.3908 1.4455 1.8090 7.2234 1.3637 4.7073 2.3573 2.3574 2.2543 2.5641 1.0797 1.0625 6.4896 6.4524 6.8655 7.0600 7.2357 1.0362 1.0885 1.0993 1.0993 1.0855 1.0854 1.0891 1.0892 1.0870 1.0938 1.0938 1.1003 1.1003 1.1059
irintensity: 0.6801 0.0093 0.0499 2.1216 0.4851 0.1509 0.2090 0.0080 1.7855 0.5138 0.0724 0.2759 3.0348 0.6391 2.0279 0.0256 5.3803 20.6293 3.7986 0.8972 0.5221 0.2242 73.2431 2.2020 16.7604 28.0542 96.9778 2.9493 0.4096 4.8844 1.9781 0.1725 0.5402 4.7039 0.4380 0.4745 4.4044 0.9150 0.0014 0.0058 19.1255 4.8347 0.4415 1.2330 3.7094 0.2196 6.6549 1.8394 0.4474 0.1742 0.9186 3.9716 1.5011 6.1597 6.8132 1.7474 1.7319 5.3167 10.1791 2.9472 15.0636 3.7529 9.6768 16.9534 43.4992 18.7736 5.5894 2.1622 1.4393 1.0258 0.1004 0.1638 3.6622 22.9773 22.3353 23.3341 26.9477 0.1547 3.7770 5.1989 8.8863 2.5652 2.0627 62.8961 57.7947 14.4607 23.7289
temp: 298.150 k
press: 1.00000 atm
elementType: 6 6 6 6 6 6 6 6 6 6 6 6 6 6 6 6 6 1 1 1 1 1 1 1 1 1 1 1 1 1 1
symmnumber: 1
zpe: 662017.6 jmol-1
zpe.correction: 0.252149 hartree
zpe.thermalcorrener: 0.264468 hartree
zpe.thermalcorrenthalpy: 0.265412 hartree
zpe.thermalcorrgfe: 0.214636 hartree
zpe.sumelectzpe: -655.034984 hartree
zpe.sumelectthermal: -655.022665 hartree
zpe.sumelectthermalent: -655.021721 hartree
zpe.sumelectthermalfe: -655.072497 hartree
dipole: 0.0000 0.2611 0.3720
dipole: 0.4545
quadrupole: -96.7900 -87.3346 -98.3271
quadrupole: 0.0000 0.0000 -3.4168
quadrupole: -2.6394 6.8160 -4.1766 0.0000 0.0000 -3.4168
hfenergy: -655.2871329 hartree
pointgroup: C01 [X(C17H14)]
dipole: 0.0000039 -0.1145318 -0.1372969 debye
polarizability: 198.3289075|0.0008058|171.483424|0.0002833|-14.0826137|130.9987199 unknown
InChI: InChI=1S/C17H14/c1-17-11-10-12(13-6-2-4-8-15(13)17)14-7-3-5-9-16(14)17/h2-12H,1H3
charge 0 multiplicity 1
31 atoms
C  0.000057 -1.370788 -0.324176
C  -0.000015 1.09457 -1.25919
C  -1.223801 -0.531714 0.136616
C  1.223859 -0.531642 0.136628
C  -1.220795 0.795853 -0.371378
C  1.220793 0.795914 -0.371393
C  0.000065 -1.255272 -1.869999
C  0.000001 0.010872 -2.355432
C  0.000099 -2.824968 0.161829
C  -2.269964 -0.962461 0.971192
C  2.270039 -0.962326 0.971215
C  -2.254017 1.690283 -0.047949
C  2.253975 1.690397 -0.047979
C  -3.319383 -0.063309 1.297129
C  3.319417 -0.063122 1.297136
C  -3.312724 1.254916 0.791538
C  3.3127 1.255093 0.791519
H  -0.000044 2.119862 -1.660903
H  0.000099 -2.164125 -2.480251
H  -0.000015 0.281139 -3.41478
H  0.000092 -2.890865 1.264864
H  -0.892551 -3.359135 -0.210302
H  0.892788 -3.35908 -0.210288
H  -2.284014 -1.982048 1.37092
H  2.284138 -1.981908 1.370955
H  -2.24401 2.714226 -0.439748
H  2.243918 2.714335 -0.439791
H  -4.138416 -0.396123 1.944822
H  4.138465 -0.395887 1.944834
H  -4.125625 1.943945 1.046946
H  4.125567 1.944165 1.046918
