program: Gaussian 09
title: 000275719
version: EM64L-G09RevD.01
frameworkgroup: C1[X(C15H12O2S)]
method: RPBEPBE
basis: SDD
operation: Freq
keyword: #p
keyword: freq=noraman
keyword: PBEPBE/SDD
title: #p freq=noraman PBEPBE/SDD
converged: YES YES NO NO
title: Mulliken charges:
elementType: S O O C C C C C C C C C C C C C C C H H H H H H H H H H H H
charge: 0.245268 -0.393486 -0.270992 0.432008 -0.162411 -0.143409 -0.313683 -0.377200 -0.387688 -0.241547 -0.245131 -0.195028 -0.271635 -0.229324 -0.222248 -0.209575 -0.239462 0.177259 0.225307 0.319267 0.228494 0.231127 0.231840 0.256955 0.249931 0.232795 0.230210 0.229486 0.230482 0.382391
chargesum: 0.00000
title: Mulliken charges with hydrogens summed into heavy atoms:
elementType: S O O C C C C C C C C C C C C C C C
charge: 0.245268 -0.011095 -0.270992 0.432008 0.062896 -0.143409 -0.313683 -0.057933 -0.159194 -0.010420 -0.013291 0.061927 -0.021705 0.003472 0.007962 0.019910 -0.008980 0.177259
polarizability: 3.53063821e+02 1.76045339e+01 1.44611193e+02 -2.03314799e+01 1.39378326e+01 1.30654737e+02
1716.lowfreq: -6.6488 -5.3327 -2.4418 0.0009 0.0014 0.0022 17.7821 23.8097 29.1704
frequency: 17.5632 23.6366 29.1518 56.5261 59.9319 106.4205 145.2671 177.4579 205.2811 224.7001 248.9769 287.6822 334.5423 374.6661 402.5983 407.2856 416.0483 434.1265 485.3712 511.5687 544.2400 586.4512 610.3213 610.5129 618.3183 673.1365 693.5542 697.7692 726.5449 739.1749 750.8107 774.5468 804.1730 845.4994 859.7602 915.1539 928.8692 955.3315 964.1969 973.8936 984.9747 988.2290 991.9145 992.8911 1015.8484 1019.5982 1030.7851 1055.7244 1071.3924 1075.6838 1094.1798 1171.1815 1174.4949 1183.5900 1204.3104 1213.7403 1285.1948 1303.3354 1335.6208 1370.9014 1376.4402 1407.3202 1426.8294 1442.3035 1459.7121 1479.5305 1564.8311 1580.7947 1587.5019 1589.7006 1597.8600 1613.9516 3083.2566 3118.7970 3126.8554 3131.0747 3134.0797 3146.0529 3146.1767 3154.5545 3163.2509 3167.8428 3179.8000 3518.8534
redmass: 6.1518 4.1525 4.9275 6.9401 5.9548 5.3432 6.1488 5.5377 5.8601 7.5510 5.2503 6.8904 4.6193 5.6789 2.9129 3.3566 5.5283 7.0238 3.5086 3.0222 4.8080 6.9369 5.7638 1.2957 6.1535 6.7758 2.2815 1.8415 6.4774 5.0225 1.5444 1.8058 6.1955 1.2475 1.2502 1.3749 1.3212 5.9933 1.5598 1.4089 5.8376 4.8282 1.4622 1.3154 3.2748 1.3444 2.2880 2.3655 2.4060 1.6146 1.6871 1.0520 1.0796 1.1162 1.1426 2.5313 1.7718 1.3212 1.5843 2.7156 8.5061 2.2306 2.1388 2.1405 2.0712 2.0892 7.1519 5.6984 6.3194 6.0432 6.7331 6.2082 1.0865 1.0875 1.0846 1.0875 1.0879 1.0935 1.0925 1.0966 1.0994 1.1017 1.0962 1.0640
irintensity: 1.0390 0.4496 0.0681 0.4958 0.2603 0.5490 0.1310 1.4819 0.2145 2.3794 1.6111 1.3033 1.7282 3.7038 1.6205 0.2221 5.2657 4.2583 15.7161 21.4328 49.2441 16.5482 3.9027 95.2222 4.0577 21.7250 32.4147 43.5030 29.5660 40.9247 76.9145 37.9415 13.0443 0.0846 1.2403 1.5332 4.1246 14.0216 19.5001 1.3884 5.0491 3.9522 0.1797 0.6531 20.1197 2.8607 2.6756 406.2779 9.2105 5.5851 35.3554 0.1015 0.7169 2.5379 14.0060 6.1351 11.4164 1.1270 10.3360 24.9064 0.4566 53.0806 7.9436 28.7846 41.5412 11.7749 80.6357 26.6262 6.2121 58.3490 40.0698 43.5964 5.5395 6.5556 1.4767 0.9061 3.4186 30.5687 12.2997 25.1476 28.0871 28.0369 37.4185 51.2475
temp: 298.150 k
press: 1.00000 atm
elementType: 16 8 8 6 6 6 6 6 6 6 6 6 6 6 6 6 6 6 1 1 1 1 1 1 1 1 1 1 1 1
symmnumber: 1
zpe: 592044.0 jmol-1
zpe.correction: 0.225498 hartree
zpe.thermalcorrener: 0.241496 hartree
zpe.thermalcorrenthalpy: 0.242440 hartree
zpe.thermalcorrgfe: 0.178729 hartree
zpe.sumelectzpe: -1126.031413 hartree
zpe.sumelectthermal: -1126.015415 hartree
zpe.sumelectthermalent: -1126.014471 hartree
zpe.sumelectthermalfe: -1126.078182 hartree
dipole: -0.4251 -0.1078 0.7664
dipole: 0.8830
quadrupole: -88.5019 -107.5766 -111.7325
quadrupole: 7.4875 -0.8901 -1.0262
quadrupole: 14.1018 -4.9730 -9.1288 7.4875 -0.8901 -1.0262
hfenergy: -1126.2569103 hartree
pointgroup: C01 [X(C15H12O2S1)]
dipole: -0.1397118 -0.3029207 -0.0969543 debye
polarizability: 347.5164906|35.6066974|140.3372698|26.5437951|-12.8770844|140.475991 unknown
InChI: InChI=1S/C15H12O2S/c16-15(17)14(11-12-7-3-1-4-8-12)18-13-9-5-2-6-10-13/h1-11,16H
charge 0 multiplicity 1
30 atoms
S  1.219243 1.576774 -0.731277
O  1.074954 1.236805 2.167925
O  -0.567858 -0.373688 2.346367
C  -2.590874 -0.149137 -0.348429
C  -1.23642 0.367548 -0.597111
C  2.688713 0.507691 -0.400974
C  -0.121487 0.668761 0.166568
C  -3.083042 -0.72284 0.864182
C  -3.486229 -0.068207 -1.46426
C  -4.417196 -1.169478 0.948937
C  -4.817213 -0.514902 -1.3726
C  2.591851 -0.902787 -0.397253
C  3.936667 1.142626 -0.20423
C  -5.291529 -1.067444 -0.159078
C  3.752863 -1.68011 -0.183599
C  5.096329 0.356784 -0.013335
C  5.008168 -1.054929 0.00275
C  0.064902 0.440032 1.619989
H  -1.089523 0.628111 -1.656858
H  -2.40814 -0.831763 1.715305
H  -3.12535 0.362315 -2.406933
H  -4.775813 -1.609426 1.886179
H  -5.481617 -0.43563 -2.239807
H  1.624076 -1.38908 -0.562278
H  3.997352 2.235846 -0.184807
H  -6.325809 -1.420908 -0.081361
H  3.675292 -2.773074 -0.174368
H  6.063365 0.849822 0.136292
H  5.907116 -1.660866 0.160171
H  1.168609 0.999255 3.130194
