program: Gaussian 09
title: 000275718
version: EM64L-G09RevD.01
frameworkgroup: C1[X(C14H13ClN2O3S)]
method: RPBEPBE
basis: SDD
operation: Freq
keyword: #p
keyword: freq=noraman
keyword: PBEPBE/SDD
title: #p freq=noraman PBEPBE/SDD
converged: YES YES NO NO
title: Mulliken charges:
elementType: Cl S O O O N N C C C C C C C C C C C C C C H H H H H H H H H H H H H
charge: -0.033485 0.859105 -0.554890 -0.535074 -0.263433 -0.280232 -0.351607 -0.120772 -0.245201 -0.209016 0.457213 -0.337216 -0.411574 0.332132 -0.799400 0.176471 -0.360296 -0.338064 -0.201174 -0.225345 -0.095084 0.294488 0.301167 0.301564 0.243527 0.245217 0.359794 0.234514 0.240223 0.229108 0.270817 0.287431 0.263840 0.265251
chargesum: 0.00000
title: Mulliken charges with hydrogens summed into heavy atoms:
elementType: Cl S O O O N N C C C C C C C C C C C C C C
charge: -0.033485 0.859105 -0.554890 -0.535074 -0.263433 0.021332 0.008187 -0.120772 0.049287 0.092151 0.457213 -0.093689 -0.166357 0.332132 -0.095555 0.176471 -0.089479 -0.050633 0.062666 0.039907 -0.095084
polarizability: 3.79517518e+02 -1.05988760e+01 2.00904151e+02 8.20381910e+00 -2.11725904e+01 1.51311951e+02
1716.lowfreq: -43.7101 0.0000 0.0017 0.0024 1.5230 5.9729 11.3698 18.4293 33.5919
frequency: -43.6671 18.1782 33.5178 38.4221 49.5837 58.9177 72.9021 96.4299 106.8006 119.0278 150.8736 160.3323 209.7602 223.3643 252.3465 270.2494 282.1670 289.3337 299.9143 328.4757 362.5572 375.7723 402.6203 407.7784 409.9610 428.7604 468.3872 489.4190 505.2449 522.5117 580.0415 619.9080 620.7464 669.6997 690.6072 704.7005 711.1560 735.1378 768.9340 778.2067 823.3733 829.4923 836.9319 845.3943 848.6921 896.6192 959.9615 963.6863 968.0412 975.1339 984.6419 985.1173 992.3385 996.9832 1021.0102 1047.8110 1049.2232 1072.6736 1114.0495 1122.3348 1150.1093 1189.9821 1192.2134 1218.4570 1251.3259 1298.6200 1303.4969 1338.1156 1368.7276 1378.7407 1391.2339 1398.6547 1399.6101 1469.6101 1472.8578 1473.6596 1474.4251 1478.3327 1571.7797 1590.3175 1592.4868 1595.1272 1607.8067 2982.3210 3061.8744 3092.9121 3131.7900 3133.3832 3141.3673 3149.9834 3155.8477 3160.4299 3175.1423 3178.5589 3191.2201 3543.7537
redmass: 1.0210 7.8811 5.5313 4.0373 6.1783 6.6730 8.7599 9.3923 5.2672 9.1258 9.4722 7.6247 7.0924 7.2991 8.6973 5.8078 10.0133 6.9615 4.7740 5.6051 4.3448 4.7607 5.3701 2.9112 3.1792 6.8972 4.8381 6.1275 3.2157 4.3667 5.9981 7.0554 6.9455 3.2584 1.6232 3.3417 5.5939 3.9185 10.3672 5.4120 1.4326 2.5413 1.3216 1.6936 1.2881 9.6410 1.3846 1.3545 1.2881 1.3735 1.6157 1.8003 2.4303 3.7313 4.0177 2.4272 1.5994 2.6538 1.3799 1.3037 3.2218 1.1304 1.1401 3.0965 3.8308 1.2588 1.2605 1.5948 5.5122 5.0890 2.8590 3.6542 1.2982 1.0500 2.2656 1.8752 1.2298 1.4606 6.7179 6.6137 6.0122 6.1680 5.2423 1.0377 1.0970 1.0991 1.0886 1.0894 1.0913 1.0969 1.0893 1.0960 1.0956 1.0974 1.0720 1.0792
irintensity: 0.4397 0.6265 1.4349 0.3265 1.3512 0.8746 0.3992 3.9625 0.2904 4.7314 19.3959 7.5922 3.2976 6.3780 12.7241 5.0460 2.3858 6.9608 0.7590 20.1089 7.3773 24.2378 4.2745 0.3080 3.6855 48.0775 2.5658 14.9742 54.6781 21.1236 14.5502 2.1059 0.4705 4.1607 46.4793 0.1346 19.8152 18.4450 57.8642 12.4105 55.4852 0.9252 2.0560 45.9092 4.5571 52.6578 72.8993 0.6106 50.8556 4.3147 2.5479 1.1452 58.5614 57.9720 19.6714 27.2936 13.3630 85.1476 17.6355 20.9244 211.3230 29.1556 6.5256 6.3167 190.2967 1.3733 7.1078 371.2975 3.4653 1.8694 10.5653 13.9785 15.4975 14.4337 56.5593 17.4437 24.7405 76.4849 7.7745 2.0550 11.8187 69.4839 173.0671 27.6741 16.6961 15.2188 6.8542 10.2414 0.1351 11.9609 0.2426 16.8117 1.2495 3.1369 30.3979 54.0095
temp: 298.150 k
press: 1.00000 atm
elementType: 17 16 8 8 8 7 7 6 6 6 6 6 6 6 6 6 6 6 6 6 6 1 1 1 1 1 1 1 1 1 1 1 1 1
symmnumber: 1
zpe: 639706.2 jmol-1
zpe.correction: 0.243651 hartree
zpe.thermalcorrener: 0.263751 hartree
zpe.thermalcorrenthalpy: 0.264695 hartree
zpe.thermalcorrgfe: 0.192230 hartree
zpe.sumelectzpe: -1732.903952 hartree
zpe.sumelectthermal: -1732.883852 hartree
zpe.sumelectthermalent: -1732.882908 hartree
zpe.sumelectthermalfe: -1732.955374 hartree
dipole: -0.8368 -3.3991 1.7924
dipole: 3.9328
quadrupole: -113.3904 -139.9282 -140.7640
quadrupole: 16.7658 4.7115 0.2613
quadrupole: 17.9705 -8.5673 -9.4032 16.7658 4.7115 0.2613
hfenergy: -1733.1476036 hartree
pointgroup: C01 [X(C14H13Cl1N2O3S1)]
dipole: 0.1888042 1.2186668 -0.9344798 debye
polarizability: 368.133786|-42.2720927|202.8589171|14.8509887|-31.783135|160.7409171 unknown
InChI: InChI=1S/C7H6ClN2O.C7H7O2S/c8-6-3-1-5(2-4-6)7(11)10-9;1-6-2-4-7(5-3-6)10(8)9/h1-4,9-10H;2-5H,1H3
charge 0 multiplicity 1
34 atoms
Cl 6.744469 -1.0566 2.191302
S  -1.697217 -1.106487 0.440828
O  -0.323551 -0.833368 1.326018
O  -2.86824 -2.075988 1.042857
O  1.116376 0.196127 -1.607154
N  -0.600598 -1.996667 -1.379206
N  0.673103 -1.964244 -0.897386
C  -2.501822 0.568738 0.078567
C  -3.888695 0.675354 0.278892
C  -1.699704 1.626238 -0.377563
C  -3.731007 3.030676 -0.440766
C  -4.494332 1.922414 0.016802
C  -2.334296 2.863636 -0.633435
C  2.761356 -0.878643 -0.143181
C  -4.400828 4.366006 -0.709159
C  1.492239 -0.79369 -0.910623
C  3.914639 -0.22748 -0.653001
C  2.821009 -1.549033 1.108569
C  5.132937 -0.282168 0.052188
C  4.034698 -1.603171 1.824491
C  5.174572 -0.979562 1.277892
H  -4.460669 -0.187182 0.636555
H  -0.621892 1.502058 -0.534472
H  -0.692102 -1.136946 -1.983629
H  -5.574124 2.03561 0.169408
H  -1.731928 3.706623 -0.990037
H  0.956256 -2.78349 -0.354174
H  -5.270801 4.251394 -1.381355
H  -4.773379 4.817626 0.229717
H  -3.704646 5.084607 -1.173145
H  3.847371 0.314832 -1.601428
H  1.907435 -1.955009 1.557602
H  6.030431 0.205461 -0.337986
H  4.088041 -2.100373 2.796812
