program: Gaussian 09
title: 000277659
version: EM64L-G09RevD.01
frameworkgroup: C1[X(C31H27N)]
method: RPBEPBE
basis: SDD
operation: Freq
keyword: #pfreq=noraman
keyword: PBEPBE/SDD
title: #p freq=noraman PBEPBE/SDD
converged: YES YES NO NO
title: Mulliken charges:
elementType: N C C C C C C C C C C C C C C C C C C C C C C C C C C C C C C C H H H H H H H H H H H H H H H H H H H H H H H H H H H
charge: -0.226102 0.223156 0.222992 0.013322 0.014465 -0.692915 -0.693129 0.317847 0.317728 -0.636173 0.508298 0.508306 -0.416124 -0.382371 -0.385338 -0.416447 -0.358633 -0.454822 -0.454847 -0.358912 -0.241676 -0.248514 -0.247812 -0.242520 -0.250793 -0.251082 -0.232362 -0.225604 -0.225570 -0.232313 -0.251018 -0.251013 0.271115 0.207612 0.207604 0.271602 0.236003 0.236066 0.265375 0.241823 0.219994 0.221176 0.242003 0.238526 0.228518 0.228516 0.238773 0.223353 0.223608 0.223633 0.223306 0.226646 0.226592 0.223493 0.223885 0.223889 0.223500 0.226684 0.226681
chargesum: 0.00000
title: Mulliken charges with hydrogens summed into heavy atoms:
elementType: N C C C C C C C C C C C C C C C C C C C C C C C C C C C C C C C
charge: -0.226102 0.223156 0.222992 0.013322 0.014465 -0.214189 -0.213923 0.317847 0.317728 0.101271 0.508298 0.508306 -0.174301 -0.162377 -0.164162 -0.174444 -0.120107 -0.226304 -0.226331 -0.120139 -0.018323 -0.024906 -0.024179 -0.019214 -0.024147 -0.024490 -0.008868 -0.001719 -0.001681 -0.008812 -0.024335 -0.024332
polarizability: 3.84280185e+02 -1.26886167e-01 3.24572851e+02 -9.06567425e+00 -3.95187959e-01 2.88386240e+02
1716.lowfreq: -24.2223 -20.3918 -6.7129 -3.8469 -0.0006 -0.0003 0.0003 8.0280 19.8783
frequency: -24.0376 -17.3288 19.7315 22.3195 25.5516 27.7902 36.1407 42.7440 53.9233 68.4918 71.1203 85.6026 98.0401 133.8159 168.8674 189.0798 206.0912 220.0175 224.7095 234.3464 244.3406 255.1920 314.5127 322.7494 366.7360 368.8205 400.3252 404.0764 405.0555 405.3006 410.3147 445.1644 459.3797 461.5263 480.8231 520.8236 557.0138 566.8505 604.9621 612.5008 616.9598 617.8758 626.0536 635.9082 654.6270 655.2057 700.0588 701.5835 703.8532 709.7724 715.3722 738.6269 741.5260 745.6151 761.2268 774.9559 787.1444 805.0042 812.8205 845.4475 854.6541 855.9795 856.5743 857.6490 902.9322 905.6283 919.4994 922.0009 951.1528 958.9429 971.5993 974.5382 977.1969 978.6921 985.5810 989.3348 990.1476 990.2851 991.4184 992.0678 992.5459 995.6963 995.8919 1024.7789 1026.3294 1026.9910 1031.5041 1075.3578 1076.6083 1079.5019 1079.9086 1107.1978 1116.3486 1127.1950 1169.8169 1170.2112 1170.5497 1170.9242 1172.9979 1183.8085 1184.6188 1185.8416 1188.6149 1194.1563 1196.8826 1208.0710 1221.8345 1267.6691 1286.7528 1298.9684 1308.0845 1309.4656 1335.5822 1335.9019 1366.0274 1366.8517 1381.0685 1381.7952 1389.1823 1397.5145 1410.8954 1429.1961 1432.9690 1440.4138 1441.5516 1450.9786 1460.9909 1465.6466 1474.3024 1476.1342 1477.7202 1481.3858 1484.1462 1486.9026 1540.1058 1557.1271 1579.3650 1582.1129 1593.0551 1593.2568 1612.5563 1613.0084 1613.9754 1616.4018 2962.6473 2963.5093 2995.5887 3020.8280 3021.1774 3085.3429 3109.1183 3109.1660 3111.0356 3117.6870 3117.8689 3118.0748 3118.3326 3123.4939 3125.5369 3130.8076 3131.1014 3137.3497 3139.0372 3141.4116 3141.8166 3145.7967 3150.3709 3160.6264 3160.8085 3161.7366 3163.5822
redmass: 3.7108 2.4923 4.9591 5.2214 5.3375 3.7343 4.8706 4.8145 1.3095 4.3372 4.1039 4.1878 3.7811 4.1425 4.4446 4.5968 4.6452 4.2409 4.4424 4.7464 4.0729 5.5095 2.1760 2.2260 4.9500 4.2188 4.9678 2.8429 2.8296 2.8364 2.9003 6.3387 2.7461 2.9476 3.4272 3.4875 5.3910 4.7055 5.4260 6.3365 6.4174 6.3836 5.9233 3.8955 5.2160 5.9105 3.2997 1.6108 2.0563 1.8196 1.6942 8.3180 1.6176 3.2224 1.8464 2.1567 2.6755 4.2391 3.9409 1.3225 1.2657 1.2407 3.1321 1.2461 1.4021 1.4993 1.5608 1.3991 2.1029 1.9437 1.3927 1.4343 1.3956 1.3816 4.4243 2.2227 4.5000 6.2111 2.4588 1.8007 1.8011 1.3242 1.5763 2.4274 2.2081 2.2186 1.9459 1.5902 1.6534 1.5908 1.5789 2.4860 1.3886 1.8460 1.0533 1.0565 1.0586 1.0664 3.1613 1.1116 1.1109 1.1156 1.1127 1.9083 2.0442 1.5521 1.9668 1.9647 1.4903 1.8751 1.4257 1.4138 1.3323 1.3225 5.5936 6.2523 6.3384 7.3081 3.8617 4.3368 2.9194 2.2701 2.2189 2.1406 2.1206 1.3242 1.1487 1.3434 1.2769 1.6782 2.3659 2.0671 1.8765 1.4728 6.9215 7.7307 5.9080 6.3376 6.1195 6.1076 6.0901 6.0780 6.4806 6.3978 1.0641 1.0640 1.0359 1.0943 1.0942 1.0988 1.0874 1.0874 1.1012 1.0862 1.0845 1.0846 1.0862 1.0872 1.0873 1.0906 1.0907 1.0924 1.0930 1.0957 1.0958 1.0965 1.0951 1.1013 1.1013 1.1016 1.1005
irintensity: 0.5237 0.0380 0.0179 0.0483 0.0217 0.0420 0.0821 0.1690 0.0441 0.1006 0.2138 0.7148 2.6849 0.0521 0.3193 2.4483 1.6852 1.2107 0.2013 0.2366 0.8707 3.1029 5.6359 0.2362 0.0290 0.5932 0.1718 0.4506 0.1503 0.0640 0.0356 1.1303 1.1621 4.6971 21.2072 10.9373 2.1357 0.6189 1.5049 0.0970 0.3403 0.3715 5.2549 16.7707 3.2989 0.1571 1.4355 47.4474 60.0799 47.4973 45.5761 3.3497 98.2760 6.5894 24.4072 27.4212 41.6104 0.0023 3.5133 0.1525 0.0001 0.0241 1.5029 0.2165 4.2891 2.7432 1.5063 6.3895 11.5688 1.1539 0.0015 0.1655 0.0184 0.0066 7.9576 1.9171 1.2501 0.2633 0.0364 1.2899 3.7315 0.2391 7.5258 20.9462 2.4194 6.8310 1.9918 2.7053 10.9675 21.7181 1.5582 4.4724 5.2237 2.9122 0.0083 0.0032 0.0069 0.1330 1.0888 0.0421 2.7297 1.7812 0.3361 2.0213 0.1048 3.1233 4.3400 0.2635 3.9358 0.1855 0.0608 2.7355 0.3641 0.7730 0.0674 0.1758 5.7676 1.8825 61.6690 2.2785 12.6754 0.6687 6.4895 5.9983 12.6511 23.7069 3.8173 6.7381 50.9476 0.7655 12.5006 0.2583 18.9208 53.3547 38.9883 2.3242 4.3077 0.0296 0.0357 0.5565 4.8013 33.0755 19.5437 17.8053 20.7980 41.7352 48.0906 3.2861 7.0428 16.3115 0.1333 18.1884 21.9135 1.0499 5.3403 7.9108 2.0070 0.2720 1.7547 0.2354 16.3217 14.0000 52.1526 26.5764 54.3951 27.9744 52.8714 9.2854 52.3192 15.4728 24.1134
temp: 298.150 k
press: 1.00000 atm
elementType: 7 6 6 6 6 6 6 6 6 6 6 6 6 6 6 6 6 6 6 6 6 6 6 6 6 6 6 6 6 6 6 6 1 1 1 1 1 1 1 1 1 1 1 1 1 1 1 1 1 1 1 1 1 1 1 1 1 1 1
symmnumber: 1
zpe: 1264975.9 jmol-1
zpe.correction: 0.481804 hartree
zpe.thermalcorrener: 0.507688 hartree
zpe.thermalcorrenthalpy: 0.508633 hartree
zpe.thermalcorrgfe: 0.422554 hartree
zpe.sumelectzpe: -1250.060955 hartree
zpe.sumelectthermal: -1250.035071 hartree
zpe.sumelectthermalent: -1250.034126 hartree
zpe.sumelectthermalfe: -1250.120205 hartree
dipole: 1.9520 -0.0112 -1.0838
dipole: 2.2327
quadrupole: -177.6057 -184.7061 -168.3875
quadrupole: 0.0766 -4.1555 -0.1109
quadrupole: -0.7060 -7.8063 8.5123 0.0766 -4.1555 -0.1109
hfenergy: -1250.542759 hartree
pointgroup: C01 [X(C31H27N1)]
dipole: -0.0050796 -0.7793621 -0.4051889 debye
polarizability: 324.5720149|0.1399193|384.7050054|-0.4365383|6.4234719|287.9622556 unknown
InChI: InChI=1S/C31H27N/c1-32-28(22-24-14-6-2-7-15-24)30(26-18-10-4-11-19-26)31(27-20-12-5-13-21-27)29(32)23-25-16-8-3-9-17-25/h2-21H,22-23H2,1H3
charge 0 multiplicity 1
59 atoms
N  0.001844 -0.923511 -1.313403
C  -1.144446 -0.174458 -1.009487
C  1.147573 -0.173334 -1.010285
C  -0.72618 1.072071 -0.500867
C  0.728298 1.073172 -0.501831
C  -2.540332 -0.713149 -1.189074
C  2.543639 -0.712174 -1.188619
C  -1.646386 2.189604 -0.157722
C  1.646639 2.192638 -0.161105
C  0.0022 -2.309312 -1.799483
C  -2.906766 -1.903032 -0.29184
C  2.908473 -1.903034 -0.292013
C  -2.483844 2.752821 -1.161949
C  1.728957 2.735035 1.150081
C  -1.742972 2.716061 1.158914
C  2.495932 2.74325 -1.16254
C  -2.451506 -1.972611 1.049374
C  3.747907 -2.936519 -0.777732
C  -3.745977 -2.936658 -0.777644
C  2.451578 -1.973645 1.048593
C  -3.380056 3.802684 -0.863715
C  2.618621 3.790214 1.449045
C  -2.63469 3.768783 1.46057
C  3.390434 3.795185 -0.866734
C  -3.457643 4.318495 0.45066
C  3.454097 4.326515 0.442208
C  -2.831137 -3.045672 1.885538
C  4.12917 -4.013482 0.055134
C  -4.128606 -4.012745 0.055729
C  2.82984 -3.047592 1.884247
C  -3.672114 -4.071024 1.392504
C  3.671044 -4.072802 1.391305
H  -3.234645 0.120747 -0.970027
H  -2.731257 -0.992283 -2.246052
H  2.736019 -0.990337 -2.245602
H  3.237994 0.121132 -0.967657
H  -0.891884 -2.489122 -2.417628
H  0.896406 -2.488743 -2.417542
H  0.002326 -3.031729 -0.963848
H  -2.407492 2.371771 -2.187345
H  1.109135 2.308642 1.945752
H  -1.133441 2.278336 1.956519
H  2.429643 2.351251 -2.184507
H  -1.796157 -1.179762 1.430328
H  4.109008 -2.896087 -1.813786
H  -4.105817 -2.897029 -1.814167
H  1.796133 -1.180862 1.429517
H  -4.010192 4.222524 -1.65632
H  2.664419 4.188832 2.469037
H  -2.691925 4.154947 2.484768
H  4.029831 4.204836 -1.657255
H  -4.149437 5.135575 0.684575
H  4.144421 5.145382 0.674194
H  -2.472003 -3.083459 2.920551
H  4.779311 -4.803992 -0.337214
H  -4.778536 -4.803391 -0.336694
H  2.469478 -3.086155 2.918804
H  -3.965368 -4.904775 2.040365
H  3.96324 -4.907226 2.038778
