program: Gaussian 09
title: 000275716
version: EM64L-G09RevD.01
frameworkgroup: C1[X(C13H20N2O2S)]
method: RPBEPBE
basis: SDD
operation: Freq
keyword: #p
keyword: freq=noraman
keyword: PBEPBE/SDD
title: #p freq=noraman PBEPBE/SDD
converged: YES YES NO NO
title: Mulliken charges:
elementType: S O O N N C C C C C C C C C C C C C H H H H H H H H H H H H H H H H H H H H
charge: 0.957851 -0.542974 -0.516775 -0.502819 0.006668 -0.490846 0.195455 -0.363616 -0.505831 -0.036599 -0.675897 -0.679971 -0.232395 -0.240248 0.453194 -0.366209 -0.363594 -0.800217 0.230586 0.213686 0.199257 0.211006 0.232169 0.210724 0.211323 0.229059 0.215037 0.294252 0.227280 0.249684 0.224731 0.286368 0.281688 0.242552 0.242567 0.241946 0.230564 0.230345
chargesum: 0.00000
title: Mulliken charges with hydrogens summed into heavy atoms:
elementType: S O O N N C C C C C C C C C C C C C
charge: 0.957851 -0.542974 -0.516775 -0.208567 0.006668 -0.046574 0.195455 0.046647 -0.062938 -0.036599 -0.020478 0.021723 0.053972 0.041440 0.453194 -0.123657 -0.121027 -0.097362
polarizability: 2.39679761e+02 -1.06653666e+01 1.91876953e+02 -9.64050924e+00 -1.01362475e+01 1.65103662e+02
1716.lowfreq: -15.6285 -1.9046 -0.0017 -0.0015 -0.0010 2.6770 13.2300 17.6826 19.8725
frequency: -6.2101 17.3138 18.4380 30.6122 44.7614 70.7624 79.4176 95.1483 106.4564 130.2796 131.6358 156.7547 192.9325 204.1071 215.1215 225.1616 250.5338 269.0657 277.7867 303.9171 323.8439 376.8297 381.8414 396.4752 403.7659 407.7490 447.4900 466.8519 511.4255 573.9708 586.0678 604.0958 622.5090 708.9543 711.1048 768.1062 777.7948 802.1354 809.0750 827.9435 832.5259 849.4344 861.4584 890.3198 946.3981 961.5172 967.3345 983.6335 989.7927 992.6548 996.8723 1030.7952 1048.3894 1048.9965 1057.8570 1069.0396 1083.6838 1120.1752 1125.8917 1185.8548 1204.5933 1218.9290 1229.8801 1252.6730 1265.1953 1288.7563 1298.5543 1319.1641 1328.1329 1346.8047 1382.7151 1387.7954 1393.3961 1393.7748 1397.3017 1451.0707 1468.9451 1470.9942 1472.1062 1473.4941 1474.4551 1475.2429 1480.3769 1485.2085 1494.0386 1577.3474 1596.7607 1596.9185 2936.9806 2965.9106 2977.1887 2979.6507 2980.3149 2987.8101 3025.3563 3046.5150 3060.0707 3062.3938 3075.8772 3078.2377 3085.7878 3090.4099 3091.8996 3136.0546 3137.8991 3164.3293 3170.2166 3198.4634
redmass: 3.3953 2.7258 1.2421 3.0470 3.7279 5.5775 2.7980 3.7953 3.1580 3.5404 4.3704 2.2686 1.8438 5.4091 1.1947 5.7936 4.1651 1.9714 4.6517 3.9417 3.6535 3.3963 2.6647 5.1077 3.6515 2.8702 2.9269 5.6773 3.0995 2.6533 4.8719 4.3972 6.9527 3.0889 2.4506 1.3317 4.4965 1.3510 7.5135 1.3946 1.8851 1.2451 2.4144 1.4895 8.7730 1.6887 1.6659 1.3893 1.4579 2.3886 4.1206 1.8990 1.6974 1.6051 2.4966 1.7213 1.9977 1.2936 2.0626 1.1405 1.4989 3.0047 1.4011 1.2316 1.3230 1.2427 1.2597 1.3796 1.5563 1.7150 6.4291 1.2139 2.3857 1.3334 1.2199 1.1020 1.0692 1.1022 1.0450 1.0707 1.0521 2.2964 1.0471 1.0809 1.0648 7.9932 7.0109 6.0649 1.0688 1.0629 1.0453 1.0390 1.0525 1.0351 1.1001 1.0916 1.0972 1.0947 1.0997 1.1002 1.1004 1.1005 1.1001 1.0894 1.0897 1.0958 1.0960 1.0735
irintensity: 1.2064 0.7624 0.7528 0.1083 0.7467 0.1896 0.3661 1.2069 0.8563 0.0509 1.4071 0.2340 0.0718 7.1554 0.2595 14.1265 4.6644 0.3117 13.3920 1.2612 12.2179 5.7722 8.4910 20.0659 69.9347 0.9295 28.4073 8.3618 74.2490 20.0338 13.9826 8.9918 0.1607 1.7712 21.9891 25.8045 10.2330 14.2724 115.0461 27.6540 43.5069 0.1321 40.9955 25.0008 68.8940 2.9206 3.2771 0.0618 2.4841 0.5623 2.1566 3.2225 11.7543 17.5449 26.7531 10.0456 1.7780 6.9174 3.6316 11.8568 1.7847 5.7364 1.9658 3.5012 0.7359 9.5167 2.5147 3.7912 6.9930 4.3559 0.4394 8.1255 2.7915 28.2748 15.1531 11.6704 3.3829 14.8746 19.2198 15.7612 13.0887 19.7878 4.6257 12.0041 16.4193 42.5975 0.2322 12.4638 28.3695 18.8488 58.0274 24.6969 22.1404 25.2859 26.2350 17.6721 12.6208 20.8609 49.3791 75.2762 42.4976 27.5934 15.0361 15.0075 8.0835 3.1694 6.4194 10.4185
temp: 298.150 k
press: 1.00000 atm
elementType: 16 8 8 7 7 6 6 6 6 6 6 6 6 6 6 6 6 6 1 1 1 1 1 1 1 1 1 1 1 1 1 1 1 1 1 1 1 1
symmnumber: 1
zpe: 806563.3 jmol-1
zpe.correction: 0.307204 hartree
zpe.thermalcorrener: 0.327554 hartree
zpe.thermalcorrenthalpy: 0.328498 hartree
zpe.thermalcorrgfe: 0.255501 hartree
zpe.sumelectzpe: -1163.804759 hartree
zpe.sumelectthermal: -1163.784409 hartree
zpe.sumelectthermalent: -1163.783464 hartree
zpe.sumelectthermalfe: -1163.856462 hartree
dipole: 1.3832 5.5058 2.0459
dipole: 6.0343
quadrupole: -91.3146 -126.5513 -117.7575
quadrupole: -13.9441 -1.6413 -6.3522
quadrupole: 20.5599 -14.6768 -5.8830 -13.9441 -1.6413 -6.3522
hfenergy: -1164.1119626 hartree
pointgroup: C01 [X(C13H20N2O2S1)]
dipole: -0.336017 -2.2389313 0.7145062 debye
polarizability: 241.5533514|-6.4507686|189.3679121|6.4395289|12.1942011|165.739112 unknown
InChI: InChI=1S/C13H20N2O2S/c1-4-6-12(5-2)14-15-18(16,17)13-9-7-11(3)8-10-13/h7-10,15H,4-6H2,1-3H3
charge 0 multiplicity 1
38 atoms
S  0.502898 2.103618 -0.26187
O  0.771256 3.307303 0.802356
O  0.267352 2.392491 -1.846031
N  -1.020166 1.190893 0.55132
N  -1.554077 0.266772 -0.330401
C  -3.299434 -1.172055 -1.192702
C  -2.81427 -0.116227 -0.220167
C  -3.67759 -2.523963 -0.519412
C  -3.764521 0.427704 0.840012
C  1.831467 0.793584 -0.094947
C  -2.46323 -3.254141 0.092781
C  -3.413386 -0.048495 2.278006
C  2.08647 -0.03382 -1.199108
C  2.537956 0.716541 1.115399
C  3.853683 -1.125628 0.133329
C  3.111327 -0.996851 -1.070481
C  3.5580 -0.254218 1.21598
C  4.932952 -2.184506 0.266338
H  -2.509819 -1.340552 -1.946858
H  -4.19196 -0.777973 -1.721984
H  -4.446933 -2.350342 0.259884
H  -4.152266 -3.169028 -1.284358
H  -4.79822 0.131205 0.588859
H  -3.747011 1.540602 0.818605
H  -2.76689 -4.206951 0.564033
H  -1.965847 -2.633374 0.859826
H  -1.709591 -3.481683 -0.683721
H  -1.631372 1.979393 0.873042
H  -3.532821 -1.142125 2.370848
H  -2.368218 0.200977 2.533854
H  -4.076992 0.432648 3.018455
H  1.516233 0.088207 -2.124907
H  2.312242 1.405221 1.935735
H  3.337349 -1.655327 -1.916996
H  4.13337 -0.33297 2.145467
H  4.508627 -3.130485 0.655231
H  5.401315 -2.411123 -0.70707
H  5.727116 -1.869524 0.965052
