program: Gaussian 09
title: 000275709
version: EM64L-G09RevD.01
frameworkgroup: C1[X(C10H14S)]
method: RPBEPBE
basis: SDD
operation: Freq
keyword: #pfreq=noraman
keyword: PBEPBE/SDD
title: #p freq=noraman PBEPBE/SDD
converged: YES YES NO NO
title: Mulliken charges:
elementType: S C C C C C C C C C C H H H H H H H H H H H H H H
charge: 0.152653 -0.366629 -0.316131 -0.692087 -0.683775 -0.162292 -0.234528 -0.264559 -0.216938 -0.212020 -0.233331 0.268304 0.199597 0.231323 0.214963 0.234091 0.234703 0.216997 0.212437 0.229292 0.247944 0.252543 0.228427 0.229202 0.229814
chargesum: 0.00000
title: Mulliken charges with hydrogens summed into heavy atoms:
elementType: S C C C C C C C C C C
charge: 0.152653 -0.098325 0.114790 -0.008330 -0.025050 -0.162292 0.013416 -0.012016 0.011489 0.017183 -0.003517
polarizability: 1.64374896e+02 9.52678419e+00 1.11845079e+02 8.94444972e+00 -1.06467417e+01 9.15205923e+01
1716.lowfreq: -19.4241 -11.9842 -9.7216 -0.0018 0.0005 0.0019 15.3307 27.0989 75.0226
frequency: 10.3325 26.6351 75.0172 109.9322 164.2946 206.2990 215.5699 254.5397 275.5312 275.6306 337.2449 403.7569 416.6565 486.1134 499.2503 594.3077 611.0403 679.0900 697.3786 754.8034 780.2797 818.0822 850.6233 922.3855 961.7341 975.7634 986.1745 990.4961 995.3608 1003.1533 1015.1996 1058.7146 1069.9841 1073.7892 1134.5583 1151.1155 1170.6090 1179.8630 1218.4350 1273.9904 1296.0481 1304.0927 1351.8607 1371.2596 1384.6446 1388.1098 1423.6840 1456.4163 1456.9128 1465.7342 1471.4654 1483.6697 1491.1633 1583.9008 1587.4040 2960.0629 2980.9428 2982.9241 3020.9635 3025.4527 3074.1476 3077.5645 3080.5877 3092.0332 3124.4669 3132.5637 3145.5738 3154.2953 3166.6923
redmass: 3.2488 4.0586 3.6718 2.1405 1.3939 2.1432 1.5731 1.7927 2.8622 5.0035 2.5264 2.9272 6.5107 3.5603 3.0930 3.0095 6.4095 6.7384 2.1326 1.5430 1.2033 2.5488 1.2424 1.3757 1.7344 1.4064 5.8137 1.4240 1.3147 1.4429 3.2120 1.5295 1.6117 2.4194 1.8624 2.1803 1.0542 1.1150 1.2521 1.1781 1.3322 1.6179 1.3508 9.0807 1.2496 1.2033 2.0878 1.1056 1.9601 1.0487 1.0483 1.0508 1.0526 6.2485 6.0348 1.0636 1.0358 1.0363 1.0895 1.0930 1.0981 1.0992 1.1001 1.0999 1.0846 1.0880 1.0928 1.0965 1.1015
irintensity: 0.0878 0.4459 0.3896 0.3329 0.8084 0.8838 0.0095 0.1990 0.6355 0.5535 0.3607 0.0845 0.3731 14.2500 3.9101 5.7809 0.3222 7.2349 39.8729 65.5665 16.9617 4.9873 0.2152 2.1219 8.0891 0.1163 3.0613 0.6297 0.0368 11.3231 14.4186 4.8997 11.4661 4.0418 21.7697 0.4262 0.0119 0.2552 10.5008 22.0767 1.0178 3.2408 1.3515 0.1836 20.4443 25.8545 9.6585 5.0718 24.8416 7.8521 18.1267 12.6755 1.1206 1.8624 11.4001 31.6311 20.7480 45.1443 14.3360 14.0862 21.0495 48.7744 37.4253 26.2171 0.8584 3.8908 18.7046 29.0622 18.5152
temp: 298.150 k
press: 1.00000 atm
elementType: 16 6 6 6 6 6 6 6 6 6 6 1 1 1 1 1 1 1 1 1 1 1 1 1 1
symmnumber: 1
zpe: 551827.6 jmol-1
zpe.correction: 0.210180 hartree
zpe.thermalcorrener: 0.222322 hartree
zpe.thermalcorrenthalpy: 0.223266 hartree
zpe.thermalcorrgfe: 0.169509 hartree
zpe.sumelectzpe: -786.684887 hartree
zpe.sumelectthermal: -786.672745 hartree
zpe.sumelectthermalent: -786.671801 hartree
zpe.sumelectthermalfe: -786.725557 hartree
dipole: 0.1608 0.3859 1.9516
dipole: 1.9959
quadrupole: -66.8445 -71.5295 -77.4369
quadrupole: 1.8682 0.2978 -4.3453
quadrupole: 5.0925 0.4074 -5.5000 1.8682 0.2978 -4.3453
hfenergy: -786.8950667 hartree
pointgroup: C01 [X(C10H14S1)]
dipole: -0.0474356 -0.064804 0.7811257 debye
dipolederiv: -0.3883187 0.0061028 -0.0949389 -0.0828941 -0.2088914 0.0303999 -0.1605506 0.036199 -0.0945796 0.3979614 -0.0058171 0.2404133 0.0749236 0.1556321 -0.0429803 0.4903038 -0.0770398 0.2734807 -0.0295331 -0.0198191 -0.0147403 -0.0832682 0.0369747 0.0016539 -0.0739051 0.0835578 0.00654 -0.1279161 -0.0574084 0.0414143 -0.0191584 0.018777 0.0474511 -0.1697853 0.0263643 0.0097479 0.072562 0.0637485 0.0168055 0.0665164 -0.0511465 -0.041618 0.0076179 -0.0335924 0.0047958 0.5855662 0.0327075 -0.1356008 0.071236 -0.0022648 -0.003223 -0.2309866 0.0170419 -0.1229931 -0.2289189 0.0884015 0.0205777 -0.0015929 0.018702 0.0264202 0.0956027 0.0148235 -0.1307076 -0.2725913 -0.0911371 -0.0313434 -0.017948 -0.013306 0.0534431 0.0095377 0.0720072 -0.0803681 -0.024312 -0.0566504 -0.081502 -0.0195493 0.0484696 0.0809809 -0.065096 0.0996768 -0.0778236 -0.0147504 0.1050376 -0.0173744 0.0727252 0.0744159 0.0535187 -0.0540829 0.0345036 -0.1065818 0.0277774 0.0316661 -0.1034892 0.029623 -0.0719333 0.0221231 -0.0714272 0.0222878 -0.1083141 -0.0375671 0.0729838 0.0280173 0.061431 -0.0690297 -0.0578192 -0.0023918 -0.0480262 -0.0699768 0.0086308 0.0117215 -0.1250336 0.0567212 0.0126401 -0.0186603 -0.1388157 -0.035428 -0.1474821 -0.1037642 -0.0439488 0.0919232 -0.0513434 0.004319 0.0139491 0.0937732 -0.0199975 0.0689875 -0.0980704 -0.0214448 -0.1037092 -0.0207024 0.1084489 0.0090036 -0.1365067 -0.0137182 -0.0595808 0.1085234 0.0276808 -0.0049573 -0.0232301 -0.1221887 0.0841013 0.0333001 0.0951328 0.0629669 0.0623852 0.0327462 0.0335081 0.0764428 0.0152541 -0.1119741 0.1024009 -0.0858605 0.0031094 -0.1777467 -0.0061265 0.045294 -0.0723451 0.0809918 -0.006942 0.0439988 -0.0132042 0.0745126 0.0825767 -0.023473 0.0223099 0.0305529 -0.1380305 0.1052993 -0.0014061 0.1304357 0.0283142 0.0568813 -0.0397364 -0.0866152 -0.040055 0.1103166 -0.0101011 -0.0583411 -0.0623038 -0.0846001 0.0682109 -0.1053002 0.0104598 -0.0836392 -0.018391 -0.027109 0.0127057 -0.0221222 0.1217235 0.0844028 0.0668008 0.0685916 0.0528407 0.0062476 -0.0596728 0.0617232 -0.0684092 0.0950458 0.0254527 0.056152 0.0690043 0.073393 -0.0285502 -0.0963814 0.0821587 -0.098037 0.0899518 0.0186491 -0.0942612 0.0135403 -0.1177372 -0.0625916 -0.0411618 0.0224682 -0.0412411 0.1338624 -0.0960909 -0.0306262 0.0974449 -0.0329426 0.0951343 -0.0107013 0.1077043 -0.0130503 0.109969 unknown
polarizability: 164.5627434|6.2669527|113.2004195|-11.3476444|8.5272054|89.9774039 unknown
InChI: InChI=1S/C10H14S/c1-3-9(2)11-10-7-5-4-6-8-10/h4-9H,3H2,1-2H3
charge 0 multiplicity 1
25 atoms
S  1.014643 0.484131 -1.300057
C  2.096755 0.549718 0.30297
C  2.100686 -0.8058 1.042362
C  3.486081 1.052015 -0.125853
C  2.778216 -1.967626 0.286097
C  -0.659361 0.281475 -0.550332
C  -1.27435 1.356568 0.136963
C  -1.348828 -0.945236 -0.703431
C  -2.568596 1.197247 0.68337
C  -2.650316 -1.095736 -0.168764
C  -3.260026 -0.028069 0.529855
H  1.600763 1.307386 0.937332
H  2.612539 -0.649065 2.016193
H  1.054505 -1.078495 1.281025
H  4.161163 1.08117 0.75068
H  3.427694 2.068128 -0.55328
H  3.942919 0.389081 -0.881867
H  3.858438 -1.787513 0.138818
H  2.670647 -2.911378 0.850941
H  2.314781 -2.105499 -0.70771
H  -0.748831 2.313796 0.226685
H  -0.865221 -1.771011 -1.235583
H  -3.039938 2.031607 1.214984
H  -3.181481 -2.046101 -0.293263
H  -4.266284 -0.147287 0.946966
