program: Gaussian 09
title: 000275706
version: EM64L-G09RevD.01
frameworkgroup: C1[X(C9H8O2S)]
method: RPBEPBE
basis: SDD
operation: Freq
keyword: #pfreq=noraman
keyword: PBEPBE/SDD
title: #p freq=noraman PBEPBE/SDD
converged: NO YES NO NO
title: Mulliken charges:
elementType: S O O C C C C C C C C C H H H H H H H H
charge: 0.266627 -0.433153 -0.264164 -0.205365 -0.223961 -0.224021 -0.207302 -0.207287 -0.223078 -0.424055 -0.201501 0.180477 0.259492 0.259493 0.236435 0.236435 0.236352 0.299627 0.263876 0.375071
chargesum: 0.00000
title: Mulliken charges with hydrogens summed into heavy atoms:
elementType: S O O C C C C C C C C C
charge: 0.266627 -0.058082 -0.264164 -0.205365 0.035531 0.035472 0.029134 0.029149 0.013274 -0.124428 0.062375 0.180477
polarizability: 1.97861636e+02 -1.07430544e+01 9.29934895e+01 1.33264923e-02 1.15055454e-02 9.03325438e+01
1716.lowfreq: -26.7437 -4.4341 -0.0014 0.0010 0.0021 2.6599 8.1523 40.6543 47.7721
frequency: -26.3204 40.4063 47.7259 139.0959 144.9496 210.7797 227.5567 268.3403 277.4336 402.6790 404.7379 442.8625 510.4314 569.7528 574.8700 609.7958 675.7666 677.7351 695.5051 755.5510 798.4220 834.3809 849.7135 925.0169 933.5442 962.8090 978.9906 985.3320 1001.1454 1014.9368 1056.2715 1073.4481 1075.5709 1174.0886 1184.0278 1205.5558 1253.7912 1302.5434 1323.7918 1374.6856 1426.7468 1459.8335 1584.8723 1589.2372 1601.6109 1631.6889 3132.9627 3142.1289 3149.2354 3153.5392 3162.0405 3167.7336 3172.9542 3527.9292
redmass: 4.4481 7.7335 7.0195 4.3673 6.0822 2.5939 5.3776 5.7251 9.6809 2.8129 10.7682 4.3888 3.8600 1.2442 5.5130 6.4784 3.1986 6.9026 2.1920 1.5421 6.3809 2.1895 1.2417 1.9408 2.3634 1.0879 1.3851 6.4217 1.3260 3.4032 2.0332 1.5938 2.3756 1.0536 1.1124 1.2255 1.3078 1.3125 2.2427 9.8733 2.0835 2.0963 6.1587 6.3554 6.4070 7.7565 1.0852 1.0886 1.0929 1.0931 1.0971 1.0925 1.1018 1.0640
irintensity: 0.0011 1.4649 0.9020 0.7949 0.1101 0.2462 2.3077 0.0341 0.5348 0.0216 6.9286 7.8304 23.2499 111.0647 51.8912 0.1403 62.7575 11.6712 43.5416 45.5421 172.7576 4.5171 0.1178 0.8352 3.4285 60.8361 0.3854 10.9830 0.1279 19.7593 425.4005 7.2089 0.5142 0.0075 3.0838 25.3203 12.2950 0.7582 70.0572 1.5235 11.0750 38.0561 135.1814 1.5869 313.5045 222.5673 0.0798 4.2408 0.4991 14.0905 18.2492 2.6995 15.8986 49.7564
temp: 298.150 k
press: 1.00000 atm
elementType: 16 8 8 6 6 6 6 6 6 6 6 6 1 1 1 1 1 1 1 1
symmnumber: 1
zpe: 382126.4 jmol-1
zpe.correction: 0.145544 hartree
zpe.thermalcorrener: 0.156124 hartree
zpe.thermalcorrenthalpy: 0.157068 hartree
zpe.thermalcorrgfe: 0.107700 hartree
zpe.sumelectzpe: -895.390641 hartree
zpe.sumelectthermal: -895.380062 hartree
zpe.sumelectthermalent: -895.379117 hartree
zpe.sumelectthermalfe: -895.428485 hartree
dipole: 2.7777 0.0960 -0.0002
dipole: 2.7794
quadrupole: -64.4530 -83.5482 -71.6066
quadrupole: -5.7765 0.0034 0.0087
quadrupole: 8.7496 -10.3456 1.5960 -5.7765 0.0034 0.0087
hfenergy: -895.5361855 hartree
pointgroup: C01 [X(C9H8O2S1)]
dipole: -1.0930096 0.0326306 -0.0000158 debye
dipolederiv: -0.6014066 0.1527635 -0.0001128 0.6205417 -0.0175071 0.0000458 -0.0004283 -0.000014 -0.0446458 -1.6299495 -0.2560213 0.0000632 -0.2302415 -0.3022235 -0.0000196 0.0005195 0.000113 -0.4375373 -0.6872337 0.0025288 0.000069 0.3406646 -1.0992437 0.0004451 0.0000208 -0.0001058 -0.3350994 0.5750685 0.2285565 -0.0000416 0.3237416 -0.1049139 0.0000201 -0.0000139 0.0000205 0.0353939 -0.2380328 0.0022846 0.106515 -0.1024671 -0.1018194 0.0658732 -0.0737976 0.000478 0.0086881 -0.2380357 0.0022415 -0.106485 -0.1023975 -0.1017955 -0.0658715 0.0738732 -0.0004726 0.0087428 -0.0788088 0.0513887 -0.1006201 0.0549405 -0.0980182 -0.0715267 -0.0322608 -0.0319339 0.0745066 -0.0788155 0.0514173 0.1006802 0.0549837 -0.0980093 0.0715161 0.0323574 0.0319194 0.074437 0.0367458 0.1377071 -0.0000281 0.1147711 -0.0537922 -0.0000306 -0.0000379 -0.0000213 -0.0372613 1.2692853 -0.5037711 0.0003185 -0.6188644 0.0841314 -0.0001062 0.0004371 -0.0000471 -0.1313837 -1.4001759 0.4605466 -0.0002015 0.5866627 -0.1448392 -0.0000231 -0.0003986 0.0000492 -0.190683 2.2530413 -0.0420862 -0.0000927 -0.779797 1.4023132 -0.000552 -0.0001314 -0.0002387 0.2469938 0.1120273 -0.05112 -0.0715658 -0.0326302 0.11422 -0.0401163 -0.0756006 -0.0271876 -0.0030718 0.1121016 -0.0511075 0.0715313 -0.0326102 0.114238 0.0401311 0.0755622 0.02719 -0.0031236 0.0392414 -0.0585082 0.0670242 -0.0731348 0.1214413 0.0442824 0.0828097 0.0441347 -0.0559288 0.039189 -0.0585287 -0.0670744 -0.0731603 0.1214357 -0.0442667 -0.0828454 -0.0441247 -0.055872 -0.0433654 -0.1217297 0.0000262 -0.136743 0.0781364 0.000026 0.0000313 0.0000254 0.0916062 0.0801591 0.018884 -0.0000136 -0.0011997 0.0061335 0.0000607 -0.0000486 0.0000873 0.1726099 0.1015524 -0.0072656 -0.0000242 -0.0024548 -0.03294 0.0000675 -0.0000527 0.0000931 0.1864344 0.3774122 0.0418193 0.0000323 0.0893946 0.1130526 0.0000446 0.0000048 0.0000352 0.3951944 unknown
polarizability: 197.7584454|11.2349507|93.0966594|0.0093923|-0.0131457|90.3325648 unknown
InChI: InChI=1S/C9H8O2S/c10-9(11)6-7-12-8-4-2-1-3-5-8/h1-7,10H
charge 0 multiplicity 1
20 atoms
S  0.042644 1.702333 -0.000704
O  4.939953 0.060455 -0.000097
O  3.362568 -1.657245 0.000465
C  -1.477845 0.641693 -0.000346
C  -2.062437 0.263132 1.229183
C  -2.062927 0.263052 -1.229616
C  -3.243509 -0.515036 1.225053
C  -3.244007 -0.515103 -1.224965
C  -3.834226 -0.904127 0.000174
C  1.315949 0.424984 -0.000084
C  2.655031 0.691261 0.00003
C  3.614688 -0.424204 0.0006
H  -1.600482 0.571643 2.172522
H  -1.601333 0.571483 -2.173158
H  -3.697668 -0.813757 2.17588
H  -3.698547 -0.81388 -2.175592
H  -4.749757 -1.505772 0.000377
H  0.955794 -0.610901 0.000245
H  3.064758 1.705331 -0.000275
H  5.559054 -0.718544 -0.000191
