program: Gaussian 09
title: 000275705
version: EM64L-G09RevD.01
frameworkgroup: C1[X(C8H18OS2)]
method: RPBEPBE
basis: SDD
operation: Freq
keyword: #p
keyword: freq=noraman
keyword: PBEPBE/SDD
title: #p freq=noraman PBEPBE/SDD
converged: YES YES NO NO
title: Mulliken charges:
elementType: S S O C C C C C C C C H H H H H H H H H H H H H H H H H H
charge: 0.544993 -0.072266 -0.586418 -0.047238 -0.086796 -0.670424 -0.660235 -0.652466 -0.647679 -0.654990 -0.642879 0.223296 0.223467 0.253813 0.256811 0.224227 0.222137 0.241862 0.213684 0.259853 0.226009 0.203919 0.256449 0.229843 0.233812 0.217218 0.276024 0.200256 0.213717
chargesum: 0.00000
title: Mulliken charges with hydrogens summed into heavy atoms:
elementType: S S O C C C C C C C C
charge: 0.544993 -0.072266 -0.586418 -0.047238 -0.086796 0.030152 0.042940 0.062934 0.038698 0.025883 0.047117
polarizability: 1.88930276e+02 3.07836032e+00 1.27192381e+02 -2.72404430e-01 -2.26304085e+00 1.05469993e+02
1716.lowfreq: -22.6370 -17.3182 -0.0017 -0.0017 -0.0015 9.6955 20.3732 50.1409 69.6893
frequency: 15.4352 50.1062 69.5840 109.2030 128.3313 183.9753 190.9263 199.2544 215.1724 215.6238 232.7142 250.1783 269.3826 273.3758 282.4238 291.1471 311.4838 337.4817 342.8217 362.5804 383.3517 395.4272 411.3075 422.3258 449.8123 515.1157 770.6825 788.0853 832.4962 926.5872 929.4234 929.8296 937.1173 956.4714 957.1421 1008.5929 1015.0622 1015.4179 1031.7038 1148.1892 1160.9726 1232.0997 1237.6148 1244.7318 1261.6764 1371.6929 1374.5006 1377.2864 1378.2398 1398.8775 1400.3197 1441.8431 1447.8280 1458.9408 1461.2241 1463.9453 1466.1010 1469.5527 1474.7344 1476.1060 1481.1903 1492.5970 1499.2910 2965.0793 2969.7747 2971.5255 2972.1134 2973.4410 2976.7510 3061.0523 3061.5519 3063.8255 3064.3999 3069.2482 3070.0213 3084.4049 3087.6151 3089.3344 3091.9558 3094.2472 3099.1109
redmass: 4.4874 2.7736 3.6247 4.7708 5.2599 1.3608 2.0787 3.4262 1.1811 2.0899 1.1609 1.1868 1.2159 2.6913 2.1002 1.1164 3.7103 2.9091 3.2883 3.6343 2.4062 2.6858 3.5515 3.1879 2.9763 3.2800 3.5015 3.3029 17.4265 1.5871 1.5307 1.5469 1.4204 1.2109 1.2053 1.5010 1.4564 1.5103 1.4239 1.8397 1.8575 2.8958 2.9743 2.9704 3.1618 1.1962 1.2087 1.2018 1.2023 1.1948 1.1958 1.0449 1.0463 1.0489 1.0490 1.0489 1.0528 1.0600 1.0504 1.0516 1.0511 1.0529 1.0507 1.0376 1.0365 1.0358 1.0358 1.0372 1.0361 1.0978 1.0968 1.0981 1.0965 1.0979 1.0960 1.1006 1.1009 1.1001 1.0998 1.1019 1.1012
irintensity: 3.6170 0.0570 0.4217 2.9617 1.2095 0.8964 0.4638 7.5520 1.5022 5.8650 1.0040 0.5173 0.0541 1.0338 1.9004 0.1562 1.3069 1.5995 4.6349 7.2674 0.2631 1.3411 7.2228 4.0430 1.1005 12.0051 0.3923 0.2594 44.8386 0.5119 1.2289 0.1835 0.6677 0.1121 0.0265 4.2239 5.2410 0.9365 1.0232 233.9185 35.9996 6.2700 10.2688 7.0543 8.6469 28.2320 10.5611 49.4755 48.6928 26.9874 2.8932 1.2690 2.7447 1.9864 8.0867 3.3670 1.8673 15.5950 9.9981 16.0029 13.2352 30.1582 10.5405 27.8297 15.6821 19.6105 14.9142 80.6882 31.6019 2.7199 17.0727 6.9905 4.5703 44.8073 41.9036 5.5567 16.2417 21.7320 14.4799 17.1718 13.8860
temp: 298.150 k
press: 1.00000 atm
elementType: 16 16 8 6 6 6 6 6 6 6 6 1 1 1 1 1 1 1 1 1 1 1 1 1 1 1 1 1 1
symmnumber: 1
zpe: 639955.2 jmol-1
zpe.correction: 0.243746 hartree
zpe.thermalcorrener: 0.260168 hartree
zpe.thermalcorrenthalpy: 0.261112 hartree
zpe.thermalcorrgfe: 0.200243 hartree
zpe.sumelectzpe: -1186.016805 hartree
zpe.sumelectthermal: -1186.000383 hartree
zpe.sumelectthermalent: -1185.999438 hartree
zpe.sumelectthermalfe: -1186.060308 hartree
dipole: -1.2357 1.7770 0.3116
dipole: 2.1867
quadrupole: -70.4977 -92.0361 -84.7982
quadrupole: -3.1077 1.0911 1.4796
quadrupole: 11.9463 -9.5921 -2.3542 -3.1077 1.0911 1.4796
hfenergy: -1186.2605508 hartree
pointgroup: C01 [X(C8H18O1S2)]
dipole: -0.5135458 -0.3957281 -0.5655465 debye
polarizability: 188.5872778|-2.191257|118.2602191|-5.2467354|11.0467976|114.7451525 unknown
InChI: InChI=1S/C4H9OS.C4H9S/c1-4(2,3)6-5;1-4(2,3)5/h1-3H3;1-3H3
charge 0 multiplicity 1
29 atoms
S  -0.774596 -0.559675 1.343869
S  0.887242 -1.4892 -0.217584
O  -0.441892 1.03707 1.645849
C  -2.329731 -0.440293 0.043033
C  2.40034 -0.301225 0.084593
C  -2.553319 -1.857534 -0.496981
C  -3.476295 0.055945 0.944268
C  -1.928238 0.591302 -1.011233
C  2.745036 -0.261298 1.58764
C  3.52986 -0.977523 -0.729573
C  2.066517 1.099937 -0.468612
H  -2.747712 -2.583879 0.313852
H  -3.440284 -1.853596 -1.160106
H  -1.690261 -2.205322 -1.091298
H  -3.232744 1.0360 1.3910
H  -3.706102 -0.658052 1.756253
H  -4.389416 0.175691 0.329994
H  -1.124558 0.207865 -1.663058
H  -2.806227 0.84264 -1.637115
H  -1.576799 1.517774 -0.519954
H  2.90813 -1.277737 1.985968
H  3.675692 0.32295 1.731521
H  1.945281 0.231481 2.167087
H  3.269226 -1.056832 -1.800212
H  3.760337 -1.986818 -0.344717
H  4.444033 -0.357203 -0.645925
H  1.223144 1.549106 0.082952
H  2.949739 1.75984 -0.351984
H  1.809895 1.047987 -1.541427
