program: Gaussian 09
title: 000277518
version: EM64L-G09RevD.01
frameworkgroup: C1[X(C6H6Cl6N2O4)]
method: RPBEPBE
basis: SDD
operation: Freq
keyword: #p
keyword: freq=noraman
keyword: PBEPBE/SDD
title: #p freq=noraman PBEPBE/SDD
converged: YES YES NO NO
title: Mulliken charges:
elementType: Cl Cl Cl Cl Cl Cl O O O O N N C C C C C C H H H H H H
charge: 0.140620 0.133619 0.138315 0.132593 0.101536 0.126941 -0.154551 -0.211401 -0.165146 -0.207257 0.144176 0.149296 0.035514 -0.080595 -0.303282 -0.431568 -0.740115 -0.668806 0.334048 0.307392 0.291315 0.304115 0.313156 0.310086
chargesum: 0.00000
title: Mulliken charges with hydrogens summed into heavy atoms:
elementType: Cl Cl Cl Cl Cl Cl O O O O N N C C C C C C
charge: 0.140620 0.133619 0.138315 0.132593 0.101536 0.126941 -0.154551 -0.211401 -0.165146 -0.207257 0.144176 0.149296 0.369561 0.226796 0.292148 0.191674 -0.740115 -0.668806
polarizability: 1.49691492e+02 6.49104046e+00 1.60883555e+02 -4.11968260e+00 -3.82381921e-01 1.41724341e+02
1716.lowfreq: -7.7371 -6.9925 -0.0032 -0.0024 -0.0022 3.2311 18.8541 25.2109 32.0792
frequency: 18.2919 25.0893 32.0307 49.5708 54.4216 61.0012 79.0381 98.3528 122.6532 142.2480 146.6459 153.8458 190.0561 207.3884 212.3809 243.0299 255.4136 264.4821 274.4843 303.0124 321.2354 337.4713 357.5798 371.6825 440.5799 471.9947 500.3011 530.4649 552.9332 593.4526 631.4889 643.8691 659.1787 681.3782 715.9259 747.3258 775.2576 810.8318 870.1049 917.9441 937.4066 1004.5652 1039.3990 1083.6275 1095.6791 1118.1617 1178.5869 1209.2667 1221.5268 1239.2563 1255.0084 1288.8215 1305.9732 1333.9794 1343.3234 1373.0093 1435.2884 1444.0410 1450.6684 1459.3931 2986.5222 3012.5366 3033.4587 3075.1560 3084.2906 3121.1851
redmass: 17.0849 20.5138 13.4854 20.1338 16.9802 13.8276 16.2875 16.3500 17.8674 18.1899 22.5786 18.7465 21.8817 12.9336 7.0391 15.5727 9.4438 13.7738 13.3851 10.8769 11.9803 9.3750 5.2567 3.7554 6.3157 5.0813 5.5894 6.4663 5.3825 4.6852 5.5885 7.1190 7.6083 6.2986 10.7606 8.9529 8.8033 7.1559 5.4972 3.0483 2.7946 2.7642 4.2542 4.0624 3.4092 3.7710 2.1530 3.5782 1.1889 1.5069 1.6889 1.3159 1.3861 1.6376 1.4116 1.2881 3.1895 3.7492 1.2417 1.0775 1.0816 1.0607 1.0646 1.1001 1.0874 1.0995
irintensity: 0.8945 0.5140 1.6152 0.0927 0.5766 2.7464 0.8956 2.6914 2.0256 3.4885 0.8632 1.2703 0.0743 1.5988 4.5202 1.1928 3.8771 0.7948 1.7778 8.0169 1.4467 4.6397 0.3980 2.8325 38.2995 13.7080 15.2270 19.2064 8.0669 16.5600 99.7212 25.8194 13.4231 39.6631 141.1193 75.9780 69.6431 15.2787 25.4501 3.4366 25.9694 49.9332 47.1969 24.0418 14.1737 10.0532 45.4334 88.5655 10.4213 61.2101 12.2594 13.4337 23.8017 59.9093 14.5413 4.5207 225.1558 38.0330 1.1279 18.5849 15.9303 11.8071 24.7527 5.8047 2.6552 2.7812
temp: 298.150 k
press: 1.00000 atm
elementType: 17 17 17 17 17 17 8 8 8 8 7 7 6 6 6 6 6 6 1 1 1 1 1 1
symmnumber: 1
zpe: 346884.6 jmol-1
zpe.correction: 0.132121 hartree
zpe.thermalcorrener: 0.152321 hartree
zpe.thermalcorrenthalpy: 0.153265 hartree
zpe.thermalcorrgfe: 0.078991 hartree
zpe.sumelectzpe: -3401.406383 hartree
zpe.sumelectthermal: -3401.386183 hartree
zpe.sumelectthermalent: -3401.385239 hartree
zpe.sumelectthermalfe: -3401.459514 hartree
dipole: 0.1146 0.0170 0.6427
dipole: 0.6530
quadrupole: -151.1005 -163.2908 -150.7432
quadrupole: -4.6128 0.5968 -4.9473
quadrupole: 3.9443 -8.2460 4.3016 -4.6128 0.5968 -4.9473
hfenergy: -3401.5385042 hartree
pointgroup: C01 [X(C6H6Cl6N2O4)]
dipole: 0.0583181 -0.028565 0.2485728 debye
dipolederiv: -0.1977178 -0.0543416 0.0355895 -0.0899369 -0.4736484 0.2485018 0.0692282 0.2778472 -0.310535 -0.4183226 -0.2230948 -0.1765904 -0.2178659 -0.3913189 -0.1697698 -0.1803078 -0.1668865 -0.247248 -0.2282709 0.0833803 0.1840511 0.0741 -0.1725435 -0.1115684 0.1559411 -0.1163725 -0.5601091 -0.5781727 0.29001 0.0391918 0.2858396 -0.3639233 -0.01011 0.0436422 -0.0174668 -0.128691 -0.2553869 0.0400732 -0.1177492 0.0358213 -0.2074253 0.1831339 -0.12911 0.1601713 -0.6231202 -0.2034019 -0.0884034 -0.0586892 -0.1055175 -0.4490669 -0.2770377 -0.0448741 -0.2631063 -0.3730854 -0.1631935 0.1270395 -0.004281 0.088347 -0.6712341 0.0607663 0.0292097 -0.1119984 -0.3850153 -0.2373167 0.0387543 0.0022174 0.054121 -0.6457881 -0.0211327 -0.0429505 0.214311 -0.5407462 -0.3244553 -0.1387447 0.1565373 -0.2261987 -0.7669857 0.1519187 0.1797956 0.0384539 -0.3576496 -0.4667956 -0.188708 0.2410598 -0.0250485 -0.5909612 -0.058899 0.2823104 0.1350412 -0.5108226 -0.0080667 -0.2333496 -0.0226693 -0.1867941 1.0664461 -0.042198 -0.0002793 -0.0920236 0.8512335 0.4918807 0.2534072 -0.4555819 0.2241305 1.2262402 0.0088071 -0.5274172 -0.0151497 0.7007548 0.0400282 0.0747169 0.12995 0.0575406 -0.0858126 -0.0081237 0.1662269 -0.1086385 -0.2610338 0.1489316 0.0458573 -0.0096686 0.1178535 0.01424 0.05862 -0.0011132 0.0389508 0.0400946 -0.1256117 -0.0041425 -0.0743782 -0.1283158 -0.1890952 0.0074477 -0.0524325 -0.0349609 -0.233024 0.0286032 -0.0040913 -0.0064022 -0.0301213 -0.0465139 -0.0738248 0.0443588 -0.2157929 -0.0246389 0.8699531 0.1499905 -0.0356548 0.15354 1.0807795 0.0437184 -0.0849678 0.0281868 1.2532775 1.087663 -0.2143198 0.1225356 -0.1539322 1.1064596 0.0909547 0.1139021 0.111526 1.2485138 0.0562725 -0.0275219 0.0128624 0.010097 0.172353 -0.0421798 -0.0228531 0.0638538 0.0561415 0.1861416 -0.0057011 -0.0002901 -0.0195981 0.0068124 -0.0080141 0.0099754 -0.0301345 0.0360014 0.0605386 -0.0233424 0.0354359 0.0072817 0.0985587 0.0456045 -0.0476901 0.0569057 0.0510586 0.1099374 0.0042435 -0.010239 0.0383427 0.1109446 -0.0607272 0.0412527 -0.0102903 0.0601011 0.0882211 0.118866 -0.0243266 0.0852112 0.1254256 0.0214794 -0.0223372 0.074421 0.1305866 0.0385413 -0.0205776 0.0370898 -0.0488971 0.0460573 -0.0373671 0.02049 -0.0168477 0.1279557 unknown
polarizability: 147.1929002|4.5898437|162.7304517|-3.5657784|2.2253938|142.3760349 unknown
InChI: InChI=1S/C6H6Cl6N2O4/c7-5(8,9)1-4(14(17)18)3(2-13(15)16)6(10,11)12/h3-4H,1-2H2
charge 0 multiplicity 1
24 atoms
Cl 2.15723 -1.949088 1.720814
Cl 3.549799 0.715562 1.475975
Cl 3.135621 -0.993644 -0.98166
Cl -4.188464 0.469502 0.791049
Cl -2.331209 -1.321185 2.379429
Cl -3.099181 -2.063077 -0.459048
O  0.202471 -2.387504 -1.591995
O  -0.208234 -0.29055 -2.388211
O  1.511464 3.89143 -0.117473
O  0.200919 2.788053 1.385881
N  -0.055453 -1.147405 -1.433562
N  0.962599 2.834221 0.346044
C  1.017549 0.277352 0.429503
C  -0.193233 -0.621129 0.015426
C  -1.517211 0.175596 0.158145
C  1.195145 1.540835 -0.448582
C  2.363911 -0.463513 0.626265
C  -2.702316 -0.642691 0.675463
H  0.740103 0.626736 1.446189
H  -0.198199 -1.529924 0.638854
H  -1.799301 0.608783 -0.819007
H  -1.371231 1.014846 0.862696
H  0.471716 1.564153 -1.282793
H  2.201906 1.634338 -0.880901
