program: Gaussian 09
title: 000277656
version: EM64L-G09RevD.01
frameworkgroup: C1[X(C23H28N2O6)]
method: RPBEPBE
basis: SDD
operation: Freq
keyword: #p
keyword: freq=noraman
keyword: PBEPBE/SDD
title: #p freq=noraman PBEPBE/SDD
converged: YES YES NO NO
title: Mulliken charges:
elementType: O O O O O O N N C C C C C C C C C C C C C C C C C C C C C C C H H H H H H H H H H H H H H H H H H H H H H H H H H H H
charge: -0.259564 -0.235902 -0.281382 -0.281754 -0.191623 -0.177596 -0.408925 0.025947 -0.392991 0.010093 -0.178262 -0.735281 -0.725406 0.199276 0.132433 0.180251 0.133955 0.106957 -0.387339 0.350504 -0.379291 -0.257553 -0.815743 -0.454306 -0.662007 0.501107 -0.367129 -0.431051 -0.221972 -0.222975 -0.231293 0.219595 0.209722 0.213811 0.288366 0.209764 0.264791 0.198919 0.216515 0.204098 0.217712 0.365385 0.282681 0.243354 0.224797 0.236171 0.233893 0.235289 0.263280 0.209036 0.243515 0.251085 0.230159 0.218239 0.264141 0.227142 0.229781 0.227328 0.230250
chargesum: 0.00000
title: Mulliken charges with hydrogens summed into heavy atoms:
elementType: O O O O O O N N C C C C C C C C C C C C C C C C C C C C C C C
charge: -0.259564 -0.235902 -0.281382 -0.281754 -0.191623 -0.177596 -0.043539 0.025947 0.036326 0.223904 0.110104 -0.061807 -0.087080 0.199276 0.132433 0.180251 0.133955 0.106957 -0.104658 0.350504 -0.135937 0.203416 -0.083281 -0.001754 0.037476 0.501107 -0.102988 -0.203909 0.007809 0.004353 -0.001043
polarizability: 3.80579453e+02 2.07390943e+00 2.95572748e+02 -1.32953111e+01 2.39551754e+01 2.11330786e+02
1716.lowfreq: -7.4411 -0.0003 -0.0002 0.0007 1.7805 3.7655 9.7694 14.7238 21.9572
frequency: 9.3668 14.6845 21.8543 28.2202 32.3735 36.6764 43.5806 46.7473 52.3212 63.6720 73.4918 76.3459 87.0724 103.3109 103.4633 115.3102 135.2765 139.2104 154.5328 174.1060 190.8560 201.0321 208.0876 217.5381 222.7886 224.7055 236.2246 250.7400 277.3571 286.1758 302.1901 320.8607 330.6071 338.5861 361.7773 372.0291 390.6497 403.0572 404.1702 421.2026 424.8859 444.2250 463.4875 487.3226 521.9617 537.9537 563.0416 584.4597 616.8949 628.7979 644.5504 651.1062 675.9950 685.5259 698.6958 704.4532 711.0824 745.1688 750.7309 773.6650 777.4050 805.4357 817.4471 824.1804 832.5131 844.0371 848.7834 855.0848 858.1520 892.4379 921.9150 928.7244 930.7406 950.1315 958.8280 968.7761 971.2023 976.7588 981.6452 990.6465 991.0748 1000.7294 1011.5391 1015.6802 1026.4422 1047.5075 1079.7167 1089.4464 1095.8038 1125.4020 1130.3478 1145.1171 1157.3333 1159.4225 1170.6865 1173.3531 1176.5554 1188.1155 1188.3753 1199.2508 1229.2989 1231.7986 1241.2670 1257.8798 1264.7428 1276.1388 1278.8740 1304.0168 1317.0902 1327.1333 1332.5495 1336.9516 1338.0570 1356.8326 1363.3895 1375.1874 1380.9167 1382.8109 1388.2160 1392.6611 1397.0578 1398.0250 1443.0032 1453.4765 1457.6068 1461.7997 1463.4587 1467.7985 1473.2749 1473.5777 1474.5741 1481.0530 1483.8549 1485.7325 1486.3770 1497.8989 1517.5073 1551.9098 1583.4654 1596.2841 1603.7935 1616.5517 1634.2608 2966.7028 2969.3982 2973.0888 2977.2291 2979.2404 2994.6092 2994.6494 3031.5284 3039.3279 3057.7788 3058.6850 3060.3224 3063.5832 3066.0598 3072.1612 3079.2090 3089.9090 3095.5136 3099.9763 3117.2407 3121.6693 3127.6572 3137.8989 3138.2922 3150.0782 3165.1730 3174.0804 3441.6671
redmass: 4.4808 5.0350 4.9624 3.7538 5.2653 4.6752 4.2045 3.4017 4.2094 3.5535 5.0066 5.9447 4.2334 4.6493 4.9359 4.3859 4.7884 3.8773 1.1010 2.6593 3.8745 2.4166 1.3114 2.0322 2.4364 6.4022 1.4915 3.3898 3.4031 3.5298 4.1794 3.3443 2.9896 3.3891 6.1465 4.0296 2.7476 3.3589 2.8877 3.4520 3.2944 3.8960 3.7123 3.6759 4.4134 5.5593 4.9683 4.8197 6.3243 5.3672 6.5879 2.3304 2.7189 3.2928 4.3067 1.9294 4.5323 5.8536 2.6588 3.1829 4.3502 2.5879 1.8098 2.9427 3.4703 3.4415 1.6913 1.7213 1.2778 5.7918 1.2968 2.4516 1.6147 1.9530 1.6184 1.6516 1.9638 1.7318 1.3891 6.1487 2.2186 1.3276 1.9497 2.6552 2.1849 1.5482 4.1459 1.5162 2.1874 2.2340 2.5855 3.4917 1.7040 2.4843 2.1076 1.0558 1.7884 1.0850 1.1198 2.1211 2.5478 1.3802 9.1533 2.5567 1.3800 1.8744 1.1216 1.3850 1.5093 1.2831 1.4243 1.4484 1.7892 1.3239 6.1788 3.7042 1.2164 4.2682 5.7889 1.2333 1.3327 1.2085 2.1911 1.0913 1.0941 1.2098 1.0447 1.0741 1.1193 1.1060 2.0166 1.0557 1.0520 1.3544 1.7069 1.0477 1.9716 5.5634 6.7036 6.1387 7.4056 6.1333 8.7794 1.0362 1.0439 1.0721 1.0623 1.0400 1.0388 1.0540 1.0595 1.0971 1.0879 1.0990 1.1073 1.0937 1.0985 1.0992 1.0993 1.0973 1.1033 1.1005 1.0874 1.1063 1.0867 1.0900 1.0917 1.0965 1.1016 1.0948 1.0795
irintensity: 0.0846 0.6260 0.7878 0.3007 1.4351 0.4990 1.7921 0.7175 0.0659 1.2543 1.2497 7.3534 1.1067 1.0973 0.9815 2.6311 0.2958 2.4243 0.2269 0.8165 1.3755 0.2290 3.0853 1.1947 4.6186 0.3940 0.8419 6.4017 5.1752 5.7226 19.6422 13.8426 9.6138 4.0150 12.4610 4.2624 2.3707 0.5321 0.6905 1.9545 2.8783 1.6369 18.1409 9.3297 18.6580 1.4527 5.9817 2.9768 0.3319 2.4252 13.0506 41.0923 55.8227 78.1840 37.5919 30.2805 25.1544 44.4081 49.5132 27.1865 3.4563 3.3609 2.8966 1.9429 77.8909 38.0809 9.4664 12.4644 0.6994 62.1396 5.1097 5.0657 3.8003 17.8022 13.2142 1.8164 15.3986 13.4364 0.1921 0.1216 10.9469 0.1168 19.6999 66.2101 4.1497 8.8190 39.2910 6.6129 44.1845 150.7403 109.2562 28.7469 0.9151 134.5847 5.6506 0.0522 15.5532 5.8907 4.7920 29.3813 22.1374 4.4926 127.6270 36.1284 56.9107 89.3987 4.2570 67.9656 80.0716 4.5319 11.7596 0.2765 20.1024 3.3969 28.6502 133.8794 20.2666 127.6927 20.6287 21.9873 5.8133 25.6968 10.5382 20.5141 13.8491 14.4077 13.3711 18.9086 17.5443 3.3988 39.8383 3.4943 12.1657 11.1903 1.9607 21.1048 258.0662 106.0360 129.2204 0.7766 3.8425 0.2872 116.1096 27.1071 26.8875 20.2486 44.9775 16.4783 28.8438 26.8281 31.2948 10.3526 9.9793 7.2518 16.4611 13.0872 93.0221 47.2776 26.4103 34.2766 0.7073 9.7410 7.7835 31.0392 0.5516 13.4254 13.3647 30.0249 26.2081 3.0281 83.9898
temp: 298.150 k
press: 1.00000 atm
elementType: 8 8 8 8 8 8 7 7 6 6 6 6 6 6 6 6 6 6 6 6 6 6 6 6 6 6 6 6 6 6 6 1 1 1 1 1 1 1 1 1 1 1 1 1 1 1 1 1 1 1 1 1 1 1 1 1 1 1 1
symmnumber: 1
zpe: 1238218.0 jmol-1
zpe.correction: 0.471612 hartree
zpe.thermalcorrener: 0.503964 hartree
zpe.thermalcorrenthalpy: 0.504908 hartree
zpe.thermalcorrgfe: 0.402385 hartree
zpe.sumelectzpe: -1451.714040 hartree
zpe.sumelectthermal: -1451.681688 hartree
zpe.sumelectthermalent: -1451.680744 hartree
zpe.sumelectthermalfe: -1451.783267 hartree
dipole: 1.2228 1.7725 -0.1792
dipole: 2.1609
quadrupole: -142.1598 -167.4270 -192.1271
quadrupole: 12.9602 13.0842 1.5665
quadrupole: 25.0782 -0.1890 -24.8891 12.9602 13.0842 1.5665
hfenergy: -1452.1856524 hartree
pointgroup: C01 [X(C23H28N2O6)]
dipole: 0.4423513 0.7011928 0.1881651 debye
polarizability: 375.8009003|19.7177326|265.5833197|-24.7118086|45.0008873|246.0987672 unknown
InChI: InChI=1S/C23H28N2O6/c1-5-30-23(27)19(13-15(2)3)24-22(26)18-12-11-16(4)21(20(18)25(28)29)31-14-17-9-7-6-8-10-17/h6-12,15,19,24H,5,13-14H2,1-4H3
charge 0 multiplicity 1
59 atoms
O  -5.905691 -0.34382 -0.933519
O  -4.064759 0.53472 -2.071787
O  2.889923 1.044767 -0.429783
O  -2.492152 0.544569 2.349484
O  -0.172096 -0.44227 -1.523586
O  1.372827 -1.40198 -0.159606
N  -2.424524 -0.014993 0.091409
N  0.594871 -0.430084 -0.484873
C  -3.695262 -2.191668 -0.017561
C  -3.011132 -2.893858 1.184345
C  -3.75567 -0.634261 0.091101
C  -3.789739 -2.681032 2.50469
C  -2.853434 -4.401606 0.871658
C  -4.553699 -0.065124 -1.086046
C  -1.881051 0.53218 1.230451
C  -0.519196 1.20125 1.122109
C  0.611625 0.783609 0.37246
C  1.856962 1.469756 0.424919
C  -0.34129 2.334382 1.956142
C  1.994112 2.635291 1.224213
C  0.874642 3.04052 1.992114
C  -6.817722 0.124399 -2.02802
C  3.286947 3.424243 1.225186
C  4.013385 0.2713 0.226648
C  -7.257091 1.568911 -1.77812
C  4.926744 -0.218649 -0.867518
C  4.519253 -1.288704 -1.705758
C  6.193499 0.380601 -1.074337
C  5.367242 -1.746467 -2.736656
C  7.046285 -0.080694 -2.10278
C  6.633088 -1.144992 -2.936442
H  -4.734263 -2.563066 -0.113511
H  -3.160622 -2.454618 -0.952845
H  -1.99628 -2.462193 1.30671
H  -4.25594 -0.353288 1.034104
H  -3.317337 -3.249878 3.326958
H  -3.801646 -1.618552 2.804931
H  -4.834416 -3.03588 2.40579
H  -2.340963 -4.923028 1.70091
H  -3.842738 -4.879852 0.733551
H  -2.263514 -4.565601 -0.049511
H  -1.952004 0.095815 -0.81504
H  -1.186715 2.633479 2.581969
H  0.959481 3.933023 2.622194
H  -7.660896 -0.582744 -1.979329
H  -6.287337 0.024535 -2.991205
H  3.98266 3.061953 2.006969
H  3.094044 4.491179 1.428305
H  3.79894 3.334498 0.252095
H  4.544111 0.941586 0.928538
H  3.546928 -0.562299 0.78247
H  -6.396648 2.256057 -1.838248
H  -7.729667 1.671269 -0.786192
H  -7.993791 1.87116 -2.545495
H  3.537405 -1.749988 -1.548516
H  6.51202 1.210975 -0.431655
H  5.0454 -2.571184 -3.382077
H  8.025308 0.387236 -2.254532
H  7.291785 -1.504094 -3.73528
