program: Gaussian 09
title: 000277507
version: EM64L-G09RevD.01
frameworkgroup: C1[X(C21H12O2)]
method: RPBEPBE
basis: SDD
operation: Freq
keyword: #pfreq=noraman
keyword: PBEPBE/SDD
title: #p freq=noraman PBEPBE/SDD
converged: NO YES NO NO
title: Mulliken charges:
elementType: O O C C C C C C C C C C C C C C C C C C C C C H H H H H H H H H H H H
charge: -0.260382 -0.298023 0.081570 0.081570 0.215843 0.215842 0.113857 0.141614 0.141613 0.413184 0.413184 -0.390159 -0.390159 -0.460701 -0.460701 -0.377435 -0.377434 -0.444859 -0.444859 -0.254884 -0.254885 -0.244527 -0.244526 0.266358 0.266358 0.248726 0.248727 0.322687 0.322687 0.242608 0.242607 0.231228 0.231228 0.231021 0.231021
chargesum: 0.00000
title: Mulliken charges with hydrogens summed into heavy atoms:
elementType: O O C C C C C C C C C C C C C C C C C C C C C
charge: -0.260382 -0.298023 0.081570 0.081570 0.215843 0.215842 0.113857 0.141614 0.141613 0.413184 0.413184 -0.123801 -0.123801 -0.211975 -0.211974 -0.054748 -0.054747 -0.202251 -0.202251 -0.023656 -0.023657 -0.013506 -0.013505
polarizability: 4.21467595e+02 1.24861120e-05 2.73933382e+02 -8.17383655e-06 6.44454994e-03 8.57301583e+01
1716.lowfreq: -5.2800 -0.0013 -0.0004 0.0012 5.3046 8.0743 32.7412 48.4186 97.0432
frequency: 32.7265 48.4141 97.0421 115.5694 130.3696 160.9220 201.6270 206.8201 259.7680 280.5456 313.7368 329.5500 373.4999 377.1867 406.6948 414.8456 424.9407 493.6917 498.4275 515.5780 522.4225 539.9539 540.5630 544.7677 550.8079 583.6530 613.3374 646.9197 656.6578 664.8167 724.2431 730.1828 745.7856 763.2784 768.6363 771.1176 790.3053 818.3029 827.3856 837.9996 839.9920 883.2535 899.3169 899.9508 947.6514 969.1187 969.7973 987.5093 987.9999 996.2618 1018.9688 1020.0862 1029.6251 1040.4173 1041.0330 1096.1801 1146.5215 1149.9734 1159.8364 1174.4565 1174.9207 1192.7506 1222.6217 1234.6348 1236.4324 1243.6687 1274.5087 1282.5592 1337.0148 1364.8040 1397.7756 1398.2030 1422.4173 1423.6432 1427.3101 1431.0223 1439.8071 1452.4642 1514.4121 1522.3237 1534.5366 1563.7516 1586.9949 1599.8379 1607.9168 1622.0892 1626.9925 3120.7774 3120.8030 3135.4056 3135.4429 3137.5029 3137.6099 3157.8782 3158.0079 3172.3485 3172.7618 3194.9312 3195.2714
redmass: 7.4820 4.5961 5.9618 4.4363 5.6574 6.1717 4.3272 4.3123 5.4762 7.1792 5.0272 6.5087 12.2005 5.4028 3.5837 3.3265 5.8418 3.5376 8.0830 7.1315 3.3895 8.6169 3.6769 3.6175 7.1831 6.3743 7.2461 3.8695 6.5998 3.7901 6.9139 6.3288 3.3913 6.3719 1.2542 1.3952 3.9509 4.5888 5.0548 1.4500 1.5271 6.0324 1.5085 1.5255 8.0833 1.3383 1.3376 1.4028 1.4023 5.6567 1.3161 1.3120 3.3767 2.6546 2.1953 2.5549 1.4822 1.2557 1.4074 1.1054 1.1145 2.3074 2.1978 2.8848 2.5402 2.1869 1.7309 1.7133 3.2672 4.1031 4.6479 4.8241 5.4891 4.5462 2.8348 2.7053 2.1833 2.6410 4.0256 4.2021 8.1713 7.5108 8.0586 6.4661 6.3241 6.4337 6.9376 1.0869 1.0869 1.0909 1.0909 1.0893 1.0893 1.0988 1.0987 1.0967 1.0968 1.0946 1.0944
irintensity: 3.3723 0.0000 1.3053 0.0000 0.6894 0.0100 3.3510 0.0000 5.6038 3.0386 0.0000 1.7431 3.1251 0.1758 2.1326 0.0000 0.0499 32.1953 0.3592 1.2390 0.0000 0.4604 0.1343 0.0000 1.4296 0.5074 34.7209 0.1420 4.0233 0.0000 3.1191 6.3295 32.1700 0.6825 0.0000 52.7544 0.0000 0.7186 0.0347 0.0000 187.2214 10.0855 0.0000 2.4498 8.5523 0.0000 2.1819 0.0000 6.5771 33.8509 0.0000 6.0938 12.3609 0.3118 7.7482 18.3203 2.6707 0.3861 15.4690 36.0541 5.9222 5.8227 0.8423 42.2747 30.7849 146.7999 25.5402 33.6358 1.4994 137.9684 3.4576 34.7674 14.9532 1.0691 83.3340 23.3335 0.0142 0.7604 168.9543 0.1457 87.6285 6.7938 25.3640 98.2223 0.0233 21.6550 28.2506 2.2150 2.2668 8.2013 11.3023 15.3161 21.1730 58.9077 17.1637 5.2774 8.4227 52.9633 4.3120
temp: 298.150 k
press: 1.00000 atm
elementType: 8 8 6 6 6 6 6 6 6 6 6 6 6 6 6 6 6 6 6 6 6 6 6 1 1 1 1 1 1 1 1 1 1 1 1
symmnumber: 1
zpe: 691173.6 jmol-1
zpe.correction: 0.263254 hartree
zpe.thermalcorrener: 0.279103 hartree
zpe.thermalcorrenthalpy: 0.280048 hartree
zpe.thermalcorrgfe: 0.219960 hartree
zpe.sumelectzpe: -956.405533 hartree
zpe.sumelectthermal: -956.389684 hartree
zpe.sumelectthermalent: -956.388740 hartree
zpe.sumelectthermalfe: -956.448828 hartree
dipole: 0.0000 2.4611 0.0007
dipole: 2.4611
quadrupole: -99.2557 -118.7461 -139.0920
quadrupole: 0.0000 0.0000 0.0062
quadrupole: 19.7756 0.2852 -20.0608 0.0000 0.0000 0.0062
hfenergy: -956.6687875 hartree
pointgroup: C01 [X(C21H12O2)]
dipole: -0.0000186 -0.9682034 -0.0125216 debye
polarizability: 421.4675949|-0.0024567|273.900748|-0.0024136|2.4780795|85.7627928 unknown
InChI: InChI=1S/C21H12O2/c22-21-19-15-7-3-1-5-13(15)9-11-17(19)23-18-12-10-14-6-2-4-8-16(14)20(18)21/h1-12H
charge 0 multiplicity 1
35 atoms
O  -0.000023 -2.261675 -0.117152
O  0.00005 1.914373 -0.061788
C  -1.272166 -0.149877 -0.08913
C  1.272192 -0.14992 -0.089149
C  -2.601075 0.45967 -0.080866
C  2.601121 0.459582 -0.080904
C  0.000027 0.634072 -0.078957
C  -1.209928 -1.560541 -0.107786
C  1.209906 -1.560582 -0.107803
C  -3.770773 -0.401294 -0.091734
C  3.77079 -0.401421 -0.091788
C  -2.354479 -2.407972 -0.118663
C  2.354429 -2.408052 -0.118695
C  -3.61408 -1.829912 -0.110603
C  3.614049 -1.830034 -0.110653
C  -2.821922 1.877696 -0.062392
C  2.822015 1.877601 -0.062436
C  -5.083443 0.167972 -0.083772
C  5.083479 0.167801 -0.083846
C  -4.120489 2.404612 -0.055028
C  4.1206 2.404474 -0.055091
C  -5.263678 1.553262 -0.065596
C  5.26376 1.553085 -0.065675
H  -2.200674 -3.490423 -0.132864
H  2.200587 -3.490498 -0.132893
H  -4.51054 -2.460333 -0.118543
H  4.510487 -2.460485 -0.118605
H  -1.951589 2.534125 -0.054254
H  1.951704 2.534059 -0.054284
H  -5.947776 -0.507099 -0.092208
H  5.94779 -0.507299 -0.092294
H  -4.256484 3.491917 -0.040956
H  4.256631 3.491774 -0.041022
H  -6.271067 1.983528 -0.059589
H  6.271164 1.983318 -0.059683
