program: Gaussian 09
title: 000275683
version: EM64L-G09RevD.01
frameworkgroup: C1[X(C13H10N2O4S)]
method: RPBEPBE
basis: SDD
operation: Freq
keyword: #p
keyword: freq=noraman
keyword: PBEPBE/SDD
title: #p freq=noraman PBEPBE/SDD
converged: YES YES NO NO
title: Mulliken charges:
elementType: S O O O O N N C C C C C C C C C C C C C H H H H H H H H H H
charge: 0.392463 -0.192805 -0.186040 -0.203340 -0.195454 0.006035 0.018777 -0.472899 0.512570 -0.284719 -0.027323 0.438937 -0.494557 0.440854 -0.423130 -0.209604 -0.210695 -0.367419 -0.369187 -0.798193 0.278202 0.338926 0.295525 0.262059 0.261837 0.242031 0.241957 0.230105 0.230268 0.244817
chargesum: 0.00000
title: Mulliken charges with hydrogens summed into heavy atoms:
elementType: S O O O O N N C C C C C C C C C C C C C
charge: 0.392463 -0.192805 -0.186040 -0.203340 -0.195454 0.006035 0.018777 -0.472899 0.512570 -0.284719 0.250879 0.438937 -0.155631 0.440854 -0.127605 0.052455 0.051142 -0.125387 -0.127230 -0.093003
polarizability: 3.18837186e+02 5.77162377e+00 2.07525268e+02 3.92336446e-01 -3.22446818e-01 1.14105201e+02
1716.lowfreq: -8.5007 -3.4315 0.0011 0.0013 0.0020 5.7614 16.9034 30.9618 39.1733
frequency: 16.7077 30.8144 39.1606 40.4627 54.2246 73.4589 90.2297 129.9699 159.9067 162.5453 168.3085 242.0700 276.2493 281.8339 305.7414 339.5322 350.1612 359.7168 397.9860 404.9593 438.5589 477.0382 504.4631 506.2776 532.9400 586.2704 605.2468 629.8679 650.0386 657.2493 692.1429 714.1467 714.9757 739.3064 756.9050 786.5371 826.2494 848.2516 856.7100 869.3118 959.8664 974.2615 978.8852 988.4518 1000.3273 1001.9382 1026.7869 1048.4964 1068.0084 1083.1081 1117.2201 1117.8640 1147.5791 1189.2832 1194.9113 1213.2543 1220.9146 1249.7619 1296.5378 1351.5690 1363.0026 1363.0863 1386.4029 1393.0399 1400.0734 1423.5845 1444.7139 1469.4471 1474.2000 1479.5901 1572.6031 1576.3780 1599.1990 1602.7919 2980.8729 3063.1408 3092.1497 3130.3412 3131.7220 3154.7434 3159.2561 3167.6474 3186.4673 3188.0727
redmass: 5.8366 4.8637 2.1720 1.4049 14.3029 9.3967 8.4575 5.3781 5.5114 11.0610 7.6259 5.4346 7.2989 7.5209 8.7761 10.1305 8.5694 2.8603 10.1612 2.8419 3.5115 5.2465 4.8789 6.1560 4.5001 6.2392 5.8443 6.9785 7.8569 7.8958 10.5345 5.6508 3.4089 5.6455 12.5447 4.8938 1.3875 1.3253 1.3123 8.6596 1.3060 1.4456 1.3860 1.4044 4.5545 1.3541 5.1877 1.5837 2.3282 2.1207 1.3183 7.7984 1.3536 1.1282 11.6291 6.0289 2.9902 1.5467 1.2798 4.8237 5.5133 8.0720 9.2243 3.2417 1.2177 7.6935 2.5263 1.0928 1.0564 2.4395 9.0106 6.2004 6.9814 6.2224 1.0389 1.0949 1.1001 1.0886 1.0888 1.0960 1.0972 1.0887 1.0930 1.0953
irintensity: 0.4922 0.0084 0.3080 0.4918 0.0024 2.2309 0.9928 1.1884 2.6547 6.1335 0.9062 0.0526 0.6822 1.2176 1.3024 1.0356 1.9627 0.2387 8.7739 0.0029 0.8484 12.7459 6.5052 15.6444 12.3442 9.8751 4.8528 0.0181 11.9450 10.0320 13.2369 9.0396 2.9559 2.5159 18.3020 4.9889 48.3198 10.1593 7.5143 23.0241 1.8953 26.1268 0.0111 0.2391 31.4044 1.4685 48.9187 26.4325 3.4234 23.6944 10.3406 12.8004 3.6664 24.5758 394.1898 300.3260 3.3502 49.0101 0.9302 79.8946 13.7699 46.5593 89.9571 5.4593 15.4799 11.0583 77.1777 15.5153 13.2907 34.4652 38.4650 0.2444 130.0907 20.9938 26.5495 16.7569 15.1526 7.3800 15.7158 12.5543 2.7231 4.2980 18.1228 6.8461
temp: 298.150 k
press: 1.00000 atm
elementType: 16 8 8 8 8 7 7 6 6 6 6 6 6 6 6 6 6 6 6 6 1 1 1 1 1 1 1 1 1 1
symmnumber: 1
zpe: 546382.8 jmol-1
zpe.correction: 0.208106 hartree
zpe.thermalcorrener: 0.226203 hartree
zpe.thermalcorrenthalpy: 0.227147 hartree
zpe.thermalcorrgfe: 0.158403 hartree
zpe.sumelectzpe: -1308.258324 hartree
zpe.sumelectthermal: -1308.240228 hartree
zpe.sumelectthermalent: -1308.239283 hartree
zpe.sumelectthermalfe: -1308.308027 hartree
dipole: -8.6688 -2.4053 -0.0068
dipole: 8.9963
quadrupole: -127.8227 -146.4598 -114.3390
quadrupole: 11.8973 0.0417 -0.1787
quadrupole: 1.7178 -16.9193 15.2015 11.8973 0.0417 -0.1787
hfenergy: -1308.4664305 hartree
pointgroup: C01 [X(C13H10N2O4S1)]
dipole: 3.2991655 -1.2371182 -0.3355532 debye
polarizability: 315.2256956|-14.9889228|209.2971629|-18.9623431|3.6613004|115.9447973 unknown
InChI: InChI=1S/C13H10N2O4S/c1-9-2-5-11(6-3-9)20-13-7-4-10(14(16)17)8-12(13)15(18)19/h2-8H,1H3
charge 0 multiplicity 1
30 atoms
S  0.955594 1.86043 -0.045709
O  -3.334711 3.136369 0.376572
O  -1.099424 3.545626 0.183059
O  -3.726426 -3.113076 0.303989
O  -5.109576 -1.301998 0.467151
N  -2.112546 2.741628 0.259374
N  -3.94247 -1.839355 0.347621
C  -0.509101 0.772822 0.073848
C  -1.838269 1.289478 0.207552
C  2.319897 0.608912 -0.200689
C  -0.370534 -0.644381 0.035564
C  4.558415 -1.128449 -0.450519
C  -2.963592 0.443665 0.297482
C  -2.769368 -0.94292 0.254212
C  -1.47476 -1.499741 0.123357
C  2.74798 0.192956 -1.481706
C  3.005408 0.17424 0.956119
C  3.856929 -0.674242 -1.598835
C  4.113234 -0.692656 0.825542
C  5.772469 -2.028877 -0.585202
H  0.629336 -1.073509 -0.065364
H  -3.962661 0.87547 0.398733
H  -1.357688 -2.586112 0.093096
H  2.220839 0.543105 -2.375376
H  2.677287 0.509477 1.945584
H  4.183599 -0.997144 -2.594247
H  4.640266 -1.029901 1.725711
H  5.901812 -2.672861 0.301797
H  5.701158 -2.678639 -1.474677
H  6.696198 -1.427716 -0.691739
