program: Gaussian 09
title: 000277713
version: EM64L-G09RevD.01
frameworkgroup: C1[X(C25H21N2O5P)]
method: RPBEPBE
basis: SDD
operation: Freq
keyword: #p
keyword: freq=noraman
keyword: PBEPBE/SDD
title: #p freq=noraman PBEPBE/SDD
converged: YES YES NO NO
title: Mulliken charges:
elementType: P O O O O O N N C C C C C C C C C C C C C C C C C C C C C C C C C H H H H H H H H H H H H H H H H H H H H H
charge: 1.182080 -0.587146 -0.550340 -0.567200 -0.226380 -0.226641 -0.418437 0.018430 -0.635675 0.527375 0.547913 -0.417856 -0.342536 -0.225857 -0.235975 -0.329878 -0.410697 0.395801 0.358756 -0.234820 -0.376193 -0.349055 0.381006 -0.367490 -0.339898 -0.343305 -0.354050 -0.190765 -0.202950 -0.194593 -0.203800 -0.240819 -0.246347 0.296642 0.350726 0.253161 0.265076 0.232239 0.234609 0.236332 0.239872 0.235100 0.286274 0.286720 0.255871 0.290075 0.281581 0.260131 0.232812 0.232338 0.232844 0.238481 0.232985 0.233473
chargesum: 0.00000
title: Mulliken charges with hydrogens summed into heavy atoms:
elementType: P O O O O O N N C C C C C C C C C C C C C C C C C C C C C C C C C
charge: 1.182080 -0.587146 -0.550340 -0.567200 -0.226380 -0.226641 -0.067712 0.018430 -0.339034 0.527375 0.547913 -0.164695 -0.077460 0.006382 -0.001366 -0.093546 -0.170825 0.395801 0.358756 0.000280 -0.089918 -0.062335 0.381006 -0.111619 -0.049823 -0.061724 -0.093919 0.042047 0.029387 0.038252 0.034681 -0.007833 -0.012875
polarizability: 4.52728424e+02 -4.35344760e+01 3.05968677e+02 -1.09457091e+01 -4.67421778e+00 2.97464545e+02
1716.lowfreq: -6.5231 -5.6740 -2.5811 -0.0008 0.0010 0.0011 7.0399 7.1311 12.6968
frequency: 4.3000 5.5788 12.5826 16.9294 19.6937 25.4992 28.8718 34.7879 41.4500 69.8285 79.0608 83.8812 95.2125 114.2572 121.1622 138.7543 163.1934 186.7155 191.4523 209.9310 224.7912 234.8662 262.8890 277.9488 291.5641 329.0300 370.1953 383.4090 399.3922 402.1217 410.0798 411.3067 413.0713 416.7646 453.4055 467.2839 480.4096 486.4406 499.0067 525.4974 535.6571 550.5638 585.3146 604.9422 608.5671 614.0874 617.7788 628.2822 645.8363 652.8089 662.6817 670.1612 691.7777 692.7898 698.4705 713.1573 729.4023 763.6403 765.7433 770.0615 776.8592 812.8703 816.8357 821.7070 835.3349 838.9213 840.9870 842.7638 854.3910 855.2207 916.7936 922.1297 929.6947 972.6222 974.7274 977.2725 980.3736 984.0893 986.3779 987.4591 990.5184 991.5755 993.0796 994.2647 1001.1080 1019.7640 1020.6986 1028.3167 1035.1394 1073.6104 1077.3185 1081.7176 1099.1427 1107.1187 1129.0104 1152.8981 1157.6690 1171.1713 1171.3276 1175.4475 1177.0301 1181.6119 1186.2776 1190.0684 1197.4672 1208.8035 1233.3399 1276.2736 1294.4387 1305.9544 1311.5999 1316.1329 1330.3939 1349.5117 1379.2573 1381.4653 1384.5485 1393.9981 1438.4995 1440.0680 1440.3624 1446.1096 1467.5490 1470.3373 1483.0844 1490.3801 1523.6367 1591.3289 1591.9212 1592.9298 1595.8633 1599.5633 1601.8561 1611.9153 1620.1648 3053.6248 3130.4672 3133.4778 3133.8869 3136.0687 3136.9192 3143.7236 3144.4812 3148.0086 3151.7283 3158.3714 3159.4998 3159.7466 3169.7202 3170.1856 3170.4485 3176.3410 3177.1984 3182.3752 3184.6820 3501.3855
redmass: 6.2514 5.3615 6.4593 4.3551 4.6635 4.9337 4.4800 5.8729 5.2884 7.0958 6.2097 7.5879 7.2249 6.6074 7.0859 6.8740 5.8701 6.5428 6.3186 6.8371 6.3445 6.3709 7.0060 5.9492 6.6096 5.2051 7.0657 7.4086 6.6451 3.0092 2.9342 3.4801 4.6046 3.2331 5.1676 4.5631 3.9284 3.7285 3.9647 4.4981 4.7660 4.6933 4.8824 6.7478 6.4282 6.3614 5.6371 6.8078 4.6025 5.6808 4.4574 2.1456 2.2287 2.2470 2.5159 2.5235 4.6974 2.2289 1.6840 1.5610 4.5911 1.5781 5.7723 3.5320 4.9274 1.3443 1.2962 1.6783 1.2920 3.3252 1.4105 1.4185 1.4362 1.3759 1.3677 1.3322 1.5480 1.3461 5.5251 5.7948 4.2331 3.0502 1.3393 1.3392 1.3192 2.1449 2.1516 2.3081 13.6794 1.5098 1.5405 1.9314 3.0257 1.7440 1.7601 2.4960 2.0157 1.0698 1.0887 1.0670 1.2425 1.3412 1.3471 1.5005 1.1766 2.5758 4.1010 1.3776 1.4351 1.3271 1.3290 2.0084 1.3296 7.0564 9.0761 9.5330 7.8433 4.4639 2.2366 2.2320 2.2404 4.8814 2.1939 2.2348 2.1792 2.1870 2.0963 5.2513 6.0700 6.1359 6.2480 6.4396 6.5537 5.9366 6.4944 1.0836 1.0852 1.0853 1.0852 1.0906 1.0885 1.0897 1.0896 1.0924 1.0894 1.0956 1.0938 1.0938 1.0960 1.0963 1.1014 1.1006 1.1007 1.0945 1.0957 1.0758
irintensity: 1.3587 0.0448 0.5025 0.2177 0.2778 0.1990 0.2202 0.0812 0.3402 1.7176 0.6710 1.4428 3.3913 3.3437 0.2355 2.0995 7.6985 5.0932 11.1931 4.8404 6.5041 3.8411 0.4035 4.6628 12.9084 35.3484 23.0345 6.9627 10.1019 1.6149 0.0488 3.1436 4.9442 3.2801 22.4820 35.9182 2.4929 76.3971 10.2412 4.2348 3.2582 21.5267 1.9799 21.1081 7.2914 0.9003 2.4409 4.8616 104.4693 69.3483 23.6400 140.9637 24.4783 30.2981 27.7439 43.8277 8.9220 13.4441 90.1667 78.7947 29.6398 3.4170 206.6594 37.8044 190.6068 19.1407 15.6562 95.8249 0.8518 3.3406 7.2271 6.8349 9.4266 0.4428 0.3013 2.6967 0.6462 0.1541 0.5993 1.3223 1.3874 0.8735 0.8027 0.5362 0.5478 36.8135 13.6476 18.9949 69.7165 7.6385 10.1710 10.8637 10.6465 45.7210 50.7806 254.9108 92.7423 7.5473 5.4237 23.5181 116.0998 80.7219 88.6003 153.4425 5.6424 128.2386 464.2365 8.8904 22.9953 0.5434 1.4406 97.1959 8.4546 89.1190 0.9039 0.4627 0.9662 89.0141 16.4576 7.7519 3.3070 3.2207 154.4309 100.0121 23.0261 11.2064 269.5967 30.8011 24.2396 12.8447 38.2224 21.3375 30.1965 21.7668 441.2655 1.8601 0.7564 0.5791 0.3122 7.4681 2.0849 11.2947 12.1214 12.3089 12.2341 23.5373 25.0723 25.4244 4.9544 5.5511 25.7045 8.7397 8.6466 0.0530 6.5553 81.1240
temp: 298.150 k
press: 1.00000 atm
elementType: 15 8 8 8 8 8 7 7 6 6 6 6 6 6 6 6 6 6 6 6 6 6 6 6 6 6 6 6 6 6 6 6 6 1 1 1 1 1 1 1 1 1 1 1 1 1 1 1 1 1 1 1 1 1
symmnumber: 1
zpe: 1062336.2 jmol-1
zpe.correction: 0.404623 hartree
zpe.thermalcorrener: 0.434313 hartree
zpe.thermalcorrenthalpy: 0.435257 hartree
zpe.thermalcorrgfe: 0.334532 hartree
zpe.sumelectzpe: -1789.711046 hartree
zpe.sumelectthermal: -1789.681356 hartree
zpe.sumelectthermalent: -1789.680412 hartree
zpe.sumelectthermalfe: -1789.781137 hartree
dipole: -6.3838 1.4993 0.6515
dipole: 6.5898
quadrupole: -244.6645 -179.2600 -188.4412
quadrupole: -9.4000 21.6994 -0.1224
quadrupole: -40.5426 24.8619 15.6807 -9.4000 21.6994 -0.1224
hfenergy: -1790.1156685 hartree
pointgroup: C01 [X(C25H21N2O5P1)]
dipole: 2.1988736 1.0683418 -0.8633298 debye
polarizability: 413.5355688|65.5891105|332.7880363|-45.9388179|-16.6592238|309.8380414 unknown
InChI: InChI=1S/C25H21N2O5P/c28-27(29)22-18-16-21(17-19-22)26-25(20-10-4-1-5-11-20)33(30,31-23-12-6-2-7-13-23)32-24-14-8-3-9-15-24/h1-19,25-26H
charge 0 multiplicity 1
54 atoms
P  1.440367 -0.12153 -0.828903
O  2.181787 0.601634 0.573129
O  0.737513 -1.526799 -0.028522
O  2.362738 -0.441881 -2.085145
O  -5.644103 -0.636029 3.739478
O  -6.427242 -0.964248 1.61755
N  -0.56512 1.324816 0.386199
N  -5.505642 -0.594971 2.451236
C  -0.040671 1.163691 -0.948735
C  0.427458 2.442048 -1.640728
C  -1.785156 0.831283 0.853869
C  0.221616 3.703815 -1.032162
C  1.024219 2.377037 -2.927441
C  0.609576 4.887812 -1.69876
C  1.408535 3.561566 -3.589908
C  -2.845991 0.439818 -0.018381
C  -1.989054 0.749857 2.266996
C  3.392362 0.136005 1.173761
C  0.143551 -2.611347 -0.747004
C  1.204519 4.821043 -2.978456
C  -4.059385 -0.029067 0.505246
C  -3.202016 0.29008 2.79249
C  -4.23449 -0.10471 1.90682
C  4.487149 1.023919 1.198051
C  0.786712 -3.226715 -1.84532
C  3.450967 -1.139214 1.777153
C  -1.09456 -3.078131 -0.253547
C  5.6728 0.623983 1.854787
C  0.158584 -4.334465 -2.459275
C  4.647948 -1.527157 2.420268
C  -1.699428 -4.194748 -0.872124
C  5.75718 -0.650205 2.463862
C  -1.078129 -4.823078 -1.977286
H  -0.76616 0.625121 -1.581766
H  0.133836 1.580155 1.091254
H  -0.261613 3.760089 -0.051634
H  1.20762 1.406567 -3.402612
H  0.441875 5.8593 -1.220959
H  1.870444 3.500998 -4.581148
H  -2.738011 0.518232 -1.10407
H  -1.178314 1.041011 2.944875
H  1.504153 5.739189 -3.495418
H  -4.880976 -0.329817 -0.150171
H  -3.367973 0.219636 3.870587
H  4.400857 1.999541 0.710244
H  1.746271 -2.844302 -2.206103
H  2.579864 -1.800501 1.738903
H  -1.558019 -2.573568 0.59977
H  6.530043 1.305249 1.882825
H  0.645022 -4.819286 -3.312794
H  4.709711 -2.514697 2.890225
H  -2.656421 -4.567683 -0.491524
H  6.680238 -0.957712 2.966555
H  -1.552539 -5.686135 -2.456138
