program: Gaussian 09
title: 000275666
version: EM64L-G09RevD.01
frameworkgroup: C1[X(C8H12N2OS)]
method: RPBEPBE
basis: SDD
operation: Freq
keyword: #p
keyword: freq=noraman
keyword: PBEPBE/SDD
title: #p freq=noraman PBEPBE/SDD
converged: YES YES NO NO
title: Mulliken charges:
elementType: S O N N C C C C C C C C H H H H H H H H H H H H
charge: 0.024715 -0.181785 -0.138469 -0.013167 0.300185 -0.384168 -0.715965 -0.688279 -0.396344 -0.155536 -0.411675 -0.142747 0.236976 0.239332 0.229425 0.225336 0.231370 0.246817 0.223310 0.220741 0.227465 0.281194 0.250206 0.291064
chargesum: 0.00000
title: Mulliken charges with hydrogens summed into heavy atoms:
elementType: S O N N C C C C C C C C
charge: 0.024715 -0.181785 -0.138469 -0.013167 0.300185 0.092140 -0.029834 0.002589 0.112315 -0.155536 0.129595 -0.142747
polarizability: 1.33941318e+02 7.69576754e+00 1.29525129e+02 7.34832896e+00 1.51095875e+00 8.08374409e+01
1716.lowfreq: -7.9655 -4.7589 -0.0023 -0.0010 0.0016 11.0139 46.6523 52.9682 74.2079
frequency: 46.6421 52.9513 74.0932 93.1429 142.3294 164.4186 224.2353 236.4563 261.5192 273.6022 283.9224 322.3337 363.1150 375.8141 447.6911 451.0819 490.2587 511.8922 599.4727 612.9154 709.8201 753.1544 828.4545 876.1010 917.4083 922.0281 945.3296 953.5780 973.4700 1013.5209 1020.3530 1048.8546 1081.8008 1135.4534 1171.6171 1182.1137 1235.8481 1248.3161 1261.6596 1282.1183 1311.4436 1342.3571 1359.1152 1383.1152 1400.0098 1401.7098 1447.8410 1459.9968 1463.5081 1469.1795 1476.8678 1483.6159 1488.7732 2199.0791 2984.4203 2987.4787 2996.6850 3008.4818 3022.3045 3057.3597 3079.3224 3084.8562 3087.9937 3089.3765 3093.7143 3112.2751
redmass: 7.2734 3.4916 2.9729 4.0502 4.5733 7.1585 1.1911 2.1911 1.4867 2.9214 1.7338 2.7335 3.0128 3.4016 4.3916 4.0818 5.9440 3.6965 6.9616 5.5371 4.7259 1.4496 3.1498 2.6352 3.8310 2.0948 3.0207 1.6790 1.6530 1.4482 4.1701 2.4462 3.2622 1.4520 2.2023 1.6542 2.1600 2.3282 2.1818 1.6920 1.3331 1.4131 1.4098 1.2254 2.1411 1.2139 1.1091 1.1283 1.0725 1.1064 1.0744 1.0709 1.0655 12.4276 1.0355 1.0361 1.0593 1.0610 1.0624 1.1002 1.0995 1.1006 1.1017 1.1012 1.1008 1.1057
irintensity: 5.2607 0.2630 3.0755 7.8888 5.0093 2.2205 0.6370 1.5237 0.8114 1.2934 0.1217 0.8741 3.3505 1.3604 1.1220 5.2917 4.6577 6.8578 5.9233 1.1721 17.7218 7.5204 8.8702 1.5695 38.4543 3.3380 0.4039 14.0419 7.4955 1.8991 6.3609 32.6183 97.4265 14.0112 15.9646 141.0947 8.2563 16.9285 130.5196 23.9823 43.1559 20.1867 88.8019 42.5164 159.1653 3.8012 12.7991 35.6605 9.3108 14.9754 22.4632 40.1087 6.3086 17.2666 13.8095 13.9702 12.0163 17.3445 38.6254 6.4666 2.1575 45.1426 7.9636 11.6592 29.7638 20.3569
temp: 298.150 k
press: 1.00000 atm
elementType: 16 8 7 7 6 6 6 6 6 6 6 6 1 1 1 1 1 1 1 1 1 1 1 1
symmnumber: 1
zpe: 501712.4 jmol-1
zpe.correction: 0.191092 hartree
zpe.thermalcorrener: 0.204052 hartree
zpe.thermalcorrenthalpy: 0.204997 hartree
zpe.thermalcorrgfe: 0.150998 hartree
zpe.sumelectzpe: -893.900843 hartree
zpe.sumelectthermal: -893.887883 hartree
zpe.sumelectthermalent: -893.886939 hartree
zpe.sumelectthermalfe: -893.940937 hartree
dipole: -4.7130 -5.9573 -0.8307
dipole: 7.6414
quadrupole: -99.7852 -87.9536 -76.1807
quadrupole: 12.2235 -2.6759 0.6454
quadrupole: -11.8121 0.0195 11.7925 12.2235 -2.6759 0.6454
hfenergy: -894.0919352 hartree
pointgroup: C01 [X(C8H12N2O1S1)]
dipole: 1.608395 -2.5223042 0.2988647 debye
dipolederiv: -0.4334176 0.245123 -0.0442568 0.1002563 -0.8519061 0.0188977 -0.0252127 0.0700737 -0.2250588 -1.0980448 0.4136507 -0.2542107 0.2762096 -0.6643147 0.0987981 -0.2401137 0.0922461 -0.2995671 -0.8466746 -0.1705844 -0.041952 -0.226705 -1.3550511 -0.1139292 -0.0442589 0.0170592 -0.3154744 -0.3684393 -0.0168122 0.0221627 -0.0323362 -0.2311283 -0.0000553 -0.0778355 -0.013835 -0.2245031 0.2279703 -0.3729071 -0.1342599 -0.2368802 0.5482988 0.0267698 -0.1516 -0.0836257 0.3304702 0.232707 -0.0503258 -0.0118958 -0.2322681 0.4014315 -0.1081631 0.0147299 -0.0559385 0.3014026 0.0314148 0.0130805 0.0485574 0.0149101 -0.0958044 0.0395413 0.0384323 0.0527498 -0.0196709 0.0150657 0.0714564 0.0437312 0.0396001 -0.0748504 -0.0200617 0.0685825 -0.0142685 -0.1228672 0.7222098 0.166203 -0.0094418 0.038486 0.1778601 -0.0144872 -0.0993516 0.0400115 0.2180539 1.2009883 -0.3359238 0.374711 -0.0223851 1.904334 0.0288934 0.3392605 -0.0807456 0.0680568 -0.1703647 -0.0736239 -0.0170821 -0.0874446 0.1360755 -0.0384045 0.0111386 -0.0776322 0.0910961 0.2516237 0.0366404 0.0681096 0.0560554 -0.0382958 0.012492 0.2260014 0.0364039 -0.0488985 0.0892853 -0.0095221 0.0273437 0.0722905 -0.0253967 0.0408126 -0.0504384 0.059984 -0.1420082 -0.0619059 0.0681796 0.0403621 0.0778932 0.0221917 0.01006 0.091066 -0.0198557 0.064927 0.0747354 -0.0081427 0.0644338 0.0092272 0.0635063 -0.0854215 0.0797358 -0.0483037 -0.0979683 -0.0436028 -0.1135487 -0.060711 -0.070128 0.0702108 -0.0152308 -0.103361 -0.0404061 0.0238848 -0.0352298 0.1387168 -0.0220512 0.0894137 -0.0448971 0.0238489 0.0074705 0.0292071 0.100616 0.0613474 -0.0529626 0.0531883 -0.0793141 -0.0173933 0.0912026 0.0326967 0.0614785 0.0215966 -0.0097473 0.142525 0.0064461 0.1211261 -0.057846 -0.0090421 -0.0271092 -0.0080143 0.0714341 -0.0652864 -0.0871104 -0.1070882 -0.061181 0.0821635 -0.0356108 -0.0584753 -0.0305056 0.0301529 0.0496808 -0.0178386 0.0156326 -0.0263506 -0.0838027 -0.0983415 0.0332296 -0.0620917 0.0630805 0.0086752 -0.0106954 0.0104276 0.0739688 0.0559567 0.1113629 0.0103675 0.0262928 0.0041739 0.0327339 0.0170953 -0.0364812 0.0008765 0.0398851 0.0996102 -0.028544 0.0676621 0.008926 0.1342755 0.007327 -0.0356753 0.1046794 0.0387728 -0.0635421 -0.0464109 -0.0179461 0.0981449 unknown
polarizability: 132.0651153|-8.1325034|131.1557435|8.0730015|-1.1479985|81.0830287 unknown
InChI: InChI=1S/C8H12N2OS/c1-8(2)6-11-7(12)10(8)5-3-4-9/h3,5-6H2,1-2H3
charge 0 multiplicity 1
24 atoms
S  0.374015 2.833325 -0.077056
O  2.359833 1.054039 0.471363
N  0.396995 0.066432 -0.094204
N  -4.51045 -0.11343 -0.281134
C  1.342405 -1.102836 -0.029535
C  2.546476 -0.415839 0.682963
C  0.772292 -2.261421 0.813229
C  1.712795 -1.569666 -1.459414
C  -0.983535 -0.026112 -0.578517
C  1.024689 1.281467 0.099342
C  -2.008278 0.210713 0.572839
C  -3.393691 0.038152 0.111614
H  2.544418 -0.597134 1.77244
H  3.521334 -0.684168 0.249002
H  0.474966 -1.913226 1.818017
H  -0.105114 -2.723269 0.325614
H  1.535329 -3.051626 0.933015
H  2.170096 -0.745298 -2.03427
H  2.432418 -2.40709 -1.414352
H  0.821508 -1.922852 -2.008439
H  -1.140524 -1.022493 -1.024899
H  -1.143911 0.741189 -1.35846
H  -1.814313 -0.490525 1.405116
H  -1.869655 1.239766 0.955527
