program: Gaussian 09
title: 000277504
version: EM64L-G09RevD.01
frameworkgroup: C1[X(C16H16N2O4)]
method: RPBEPBE
basis: SDD
operation: Freq
keyword: #p
keyword: freq=noraman
keyword: PBEPBE/SDD
title: #p freq=noraman PBEPBE/SDD
converged: YES YES NO NO
title: Mulliken charges:
elementType: O O O O N N C C C C C C C C C C C C C C C C H H H H H H H H H H H H H H H H
charge: -0.266779 -0.265976 -0.210632 -0.203214 0.010436 0.017195 -0.307584 0.512179 0.051843 0.316660 -0.470832 -0.440176 0.361304 -0.189383 -0.383575 -0.341298 -0.353671 -0.514732 -0.244957 -0.252409 -0.234095 -0.485658 0.211655 0.319099 0.241736 0.237599 0.287711 0.273434 0.274930 0.200391 0.228282 0.242882 0.228842 0.227214 0.231328 0.237005 0.229933 0.223312
chargesum: 0.00000
title: Mulliken charges with hydrogens summed into heavy atoms:
elementType: O O O O N N C C C C C C C C C C C C C C C C
charge: -0.266779 -0.265976 -0.210632 -0.203214 0.010436 0.017195 -0.095929 0.512179 0.051843 0.316660 -0.151734 -0.198440 0.361304 0.048216 -0.095864 -0.067864 -0.078742 0.156823 -0.016115 -0.025195 -0.002766 0.204592
polarizability: 2.91304293e+02 2.76338430e+01 1.85755642e+02 -4.36047858e+00 -4.74235883e-01 1.60845543e+02
1716.lowfreq: -6.0864 -4.7972 -4.0711 0.0005 0.0007 0.0008 19.1799 24.4610 40.4714
frequency: 19.1617 24.4178 40.4638 42.0071 62.8175 74.1649 86.8051 101.6321 106.7693 134.9902 148.2413 165.9386 172.4755 187.3668 207.3676 247.6095 262.3560 279.1943 298.2246 341.5769 345.0204 381.3717 400.2563 419.3109 427.7559 443.6220 500.2031 514.5856 553.9392 614.5439 622.1317 639.9306 665.4175 680.6657 697.5148 698.6826 712.7471 760.9267 768.0243 782.0413 818.7641 853.3786 880.6594 904.4800 913.7738 935.3402 944.4962 962.1321 968.9109 980.6737 990.1001 990.2779 997.9397 999.2600 1011.3509 1028.3375 1069.8769 1082.0882 1088.7583 1095.3691 1110.1493 1111.7396 1145.7273 1157.4466 1174.7076 1175.1049 1196.6699 1203.1470 1222.9396 1238.2361 1274.2241 1299.4627 1329.9541 1333.5758 1370.4620 1377.5015 1404.8670 1419.8783 1426.1414 1434.8359 1437.6247 1447.3550 1454.4783 1472.1158 1475.7448 1476.1475 1478.9907 1555.2991 1580.8602 1593.3845 1609.0435 1614.8378 2934.7553 2940.4926 2989.7219 3027.2895 3095.0751 3112.6390 3124.9967 3126.3331 3126.5565 3137.6754 3153.5117 3157.1078 3165.1200 3186.9214 3189.8501 3191.5396
redmass: 6.2292 5.7146 4.4735 6.1676 6.2206 3.3830 2.5725 1.7607 4.8811 2.8520 2.0504 1.7799 4.9156 4.2657 2.6721 5.6115 4.6556 4.6720 5.1539 4.2204 6.4400 8.9454 2.8475 3.9413 3.8288 4.1504 7.9170 5.9665 5.7944 6.2994 4.7995 5.7738 7.9059 4.4976 2.0925 2.0816 6.7153 6.5306 3.4959 2.6722 1.5968 1.2514 5.1079 4.6824 3.0178 1.5024 1.7936 1.5701 6.3046 1.5000 5.6438 4.4695 1.3565 1.3821 8.5470 2.5327 2.3660 1.6653 1.8799 1.8512 1.2630 1.2521 1.3896 1.5777 1.0600 1.1371 1.4833 2.0530 5.5091 2.0952 1.4671 1.5441 1.3615 1.5638 10.7155 7.5305 5.1026 1.1388 1.2501 2.2298 2.2073 1.0539 1.0558 1.0516 1.5076 1.5846 2.1556 7.6775 6.0510 6.5742 5.8981 7.0161 1.0793 1.0388 1.0288 1.1002 1.1055 1.0990 1.0894 1.0862 1.1024 1.0897 1.0942 1.0929 1.0989 1.0955 1.0930 1.0951
irintensity: 1.0208 0.7242 0.1363 0.0216 0.7933 2.6015 4.2334 0.6768 0.4405 1.7317 1.2829 2.4492 1.9512 0.7457 4.1352 2.9527 8.4357 2.9970 1.3553 15.7667 1.1429 1.8413 0.2581 2.7895 1.5754 1.4742 8.0663 4.7002 3.2219 0.8836 24.0668 4.2633 26.8897 3.6664 59.0207 46.5042 3.2857 45.1763 34.2144 28.1895 14.3215 0.6563 35.0095 38.1301 5.2993 5.0093 6.8716 6.0229 178.0619 3.1291 0.9403 3.3179 1.8427 1.1579 91.5150 6.2409 1.5358 39.2856 14.1242 7.2515 0.2557 0.0655 6.8769 2.2895 0.7838 11.6894 63.9854 51.3756 189.6875 15.4619 2.5954 11.2681 3.5233 2.8084 116.8466 2.3411 2.5188 0.4280 6.0020 10.7680 17.9013 14.5385 6.4217 26.0681 14.4245 10.9984 27.2139 7.4193 2.0377 5.2453 0.0753 1.7492 29.6779 74.8307 71.0057 51.4556 32.7694 20.5882 7.0418 0.9958 17.4012 14.6187 21.9054 13.3628 25.9802 1.5586 8.0286 5.3606
temp: 298.150 k
press: 1.00000 atm
elementType: 8 8 8 8 7 7 6 6 6 6 6 6 6 6 6 6 6 6 6 6 6 6 1 1 1 1 1 1 1 1 1 1 1 1 1 1 1 1
symmnumber: 1
zpe: 762083.9 jmol-1
zpe.correction: 0.290262 hartree
zpe.thermalcorrener: 0.311197 hartree
zpe.thermalcorrenthalpy: 0.312142 hartree
zpe.thermalcorrgfe: 0.237875 hartree
zpe.sumelectzpe: -1027.945609 hartree
zpe.sumelectthermal: -1027.924674 hartree
zpe.sumelectthermalent: -1027.923730 hartree
zpe.sumelectthermalfe: -1027.997997 hartree
dipole: -4.2091 -2.3038 3.5698
dipole: 5.9806
quadrupole: -144.4668 -108.9262 -127.1393
quadrupole: -4.7316 8.8254 2.4746
quadrupole: -17.6227 17.9179 -0.2952 -4.7316 8.8254 2.4746
hfenergy: -1028.2358717 hartree
pointgroup: C01 [X(C16H16N2O4)]
dipole: -1.2387476 1.98774 -0.2252044 debye
polarizability: 277.8589393|-45.2323233|185.6920455|-10.7950386|13.9421515|174.3544931 unknown
InChI: InChI=1S/C16H16N2O4/c1-21-16(13-9-6-10-14(11-13)18(19)20)15(17-22-2)12-7-4-3-5-8-12/h3-11,16H,1-2H3
charge 0 multiplicity 1
38 atoms
O  -0.453027 -0.199352 2.222538
O  -1.543295 -1.610547 -1.773885
O  5.374685 -1.863787 0.023711
O  3.580719 -2.921305 0.949892
N  -0.644754 -0.979584 -0.828288
N  4.145453 -1.887792 0.421879
C  -0.239772 0.542233 0.958972
C  1.223028 0.514418 0.523507
C  -1.219932 -0.069639 -0.059656
C  -2.627623 0.411439 -0.050171
C  1.992418 -0.660492 0.677212
C  1.823487 1.668542 -0.03362
C  3.337423 -0.650544 0.2618
C  3.175307 1.654986 -0.452605
C  3.950437 0.488362 -0.308564
C  -3.434637 0.43151 -1.225159
C  -3.184688 0.911324 1.163557
C  0.15566 0.466195 3.384376
C  -4.744868 0.952414 -1.184288
C  -4.499682 1.416941 1.201109
C  -5.285886 1.445214 0.025526
C  -0.788374 -2.674856 -2.464511
H  -0.538161 1.604124 1.112428
H  1.551789 -1.560731 1.111829
H  1.230354 2.584349 -0.147871
H  3.623585 2.555424 -0.884646
H  4.998042 0.441891 -0.616478
H  -3.030399 0.042558 -2.16144
H  -2.593872 0.85566 2.083254
H  -0.236646 1.497951 3.50876
H  1.259238 0.506377 3.300315
H  -0.124879 -0.145155 4.255756
H  -5.34772 0.967405 -2.099232
H  -4.914424 1.781596 2.147496
H  -6.307409 1.84059 0.053264
H  -0.440724 -3.431862 -1.740782
H  0.073929 -2.248938 -3.006242
H  -1.510883 -3.117117 -3.168742
