program: Gaussian 09
title: 000275662
version: EM64L-G09RevD.01
frameworkgroup: C1[X(C7H10N2S2)]
method: RPBEPBE
basis: SDD
operation: Freq
keyword: #p
keyword: freq=noraman
keyword: PBEPBE/SDD
title: #p freq=noraman PBEPBE/SDD
converged: NO YES NO NO
title: Mulliken charges:
elementType: S S N N C C C C C C C H H H H H H H H H H
charge: 0.300747 0.033963 0.045014 -0.012539 -0.351782 -0.367780 -0.409816 -0.674142 -0.561485 -0.396040 -0.141241 0.237004 0.225006 0.243328 0.227646 0.287613 0.232699 0.279535 0.262071 0.291829 0.248369
chargesum: 0.00000
title: Mulliken charges with hydrogens summed into heavy atoms:
elementType: S S N N C C C C C C C
charge: 0.300747 0.033963 0.045014 -0.012539 0.110228 0.103194 0.110495 -0.132536 -0.561485 0.144158 -0.141241
polarizability: 1.60869284e+02 1.25521390e+01 1.29813155e+02 -1.01295583e+01 -1.55996279e+00 7.13750944e+01
1716.lowfreq: -16.9273 -10.1072 -0.0034 -0.0027 -0.0027 6.8531 41.1155 47.0914 68.0715
frequency: 41.0439 46.9731 68.0029 91.2964 123.3755 167.0027 254.8156 283.8545 301.7851 342.1854 366.3673 400.0813 423.1915 474.0445 520.6990 550.9965 589.0664 600.2330 750.8671 831.9899 846.8681 901.4522 922.5756 944.5931 996.7846 1012.3657 1020.0349 1054.8990 1075.8878 1134.4244 1176.2063 1182.4729 1213.1914 1272.5113 1273.8589 1289.0129 1294.9910 1333.0979 1349.0870 1360.7991 1407.0897 1446.8783 1447.6498 1452.1226 1459.4537 1493.0169 2200.1179 2964.0944 2993.6696 2998.4559 3020.2381 3031.2849 3053.5635 3062.8556 3069.3527 3092.6053 3110.0287
redmass: 3.4309 7.5722 5.8850 2.8207 4.0725 7.0516 3.8360 2.4117 7.6224 4.7140 3.7792 3.8242 3.5911 4.5573 5.4378 4.4264 7.0402 3.5931 1.2669 2.0190 1.6213 2.7536 4.7540 4.5563 2.4667 3.5168 1.5807 2.1963 2.1608 1.6192 1.5368 1.4404 1.5778 1.2840 1.3093 1.2511 1.2829 1.5169 1.4205 1.2450 1.7180 1.1026 1.0812 1.0865 1.1227 1.2443 12.4301 1.0682 1.0586 1.0611 1.0593 1.0592 1.1014 1.0991 1.0963 1.1056 1.1087
irintensity: 0.5583 5.0439 1.6277 4.5203 4.8622 2.8224 2.2182 3.5218 2.8446 5.2659 0.9979 2.4218 8.6274 2.5775 6.5284 4.0929 5.5578 4.1794 7.3863 5.0613 2.0679 36.6262 88.3051 5.5376 8.6638 1.0892 3.0067 15.2534 20.7059 34.9974 45.4631 39.5338 25.5222 1.2989 5.1382 64.1238 38.7656 65.7738 3.8029 18.2205 59.5167 8.2970 6.9146 20.3009 27.9095 59.2056 19.8833 37.5318 13.8048 24.7762 21.9813 24.3132 6.1013 22.3827 21.4567 6.8003 16.2146
temp: 298.150 k
press: 1.00000 atm
elementType: 16 16 7 7 6 6 6 6 6 6 6 1 1 1 1 1 1 1 1 1 1
symmnumber: 1
zpe: 425783.6 jmol-1
zpe.correction: 0.162172 hartree
zpe.thermalcorrener: 0.173900 hartree
zpe.thermalcorrenthalpy: 0.174844 hartree
zpe.thermalcorrgfe: 0.122583 hartree
zpe.sumelectzpe: -1177.514430 hartree
zpe.sumelectthermal: -1177.502703 hartree
zpe.sumelectthermalent: -1177.501759 hartree
zpe.sumelectthermalfe: -1177.554019 hartree
dipole: -4.6595 -6.0450 0.6220
dipole: 7.6577
quadrupole: -102.5617 -82.6447 -79.0875
quadrupole: 9.4023 1.9661 0.3940
quadrupole: -14.4637 5.4533 9.0104 9.4023 1.9661 0.3940
hfenergy: -1177.6766024 hartree
pointgroup: C01 [X(C7H10N2S2)]
dipole: -1.8835482 -2.3277181 0.3328519 debye
dipolederiv: -0.5151475 -0.1408453 0.0470661 -0.061223 0.0503618 0.0335139 0.0822407 -0.0120044 -0.0566307 -0.636453 -0.349059 0.0626157 -0.2139904 -0.7321469 0.1070054 0.0299482 0.1266829 -0.2175315 -0.963464 0.297193 -0.0661816 0.2420732 -1.1407309 0.1033926 0.0432254 -0.1064933 -0.2096986 -0.3920697 0.0245071 -0.0484377 0.0371716 -0.2342737 0.0047703 0.0604742 -0.0148477 -0.218464 0.1110225 0.1962599 -0.0265337 0.1276762 0.4686687 -0.0659916 -0.0531949 -0.0591624 0.3005071 -0.0219734 -0.0661821 -0.0216851 -0.0192449 -0.0270953 -0.0316911 0.0027925 0.0497861 0.0760222 0.6994625 -0.1861787 0.109609 0.0222587 0.1510328 0.0118916 0.1501598 0.105021 0.2339116 -0.0548946 0.0755351 0.0284082 0.1565826 0.1768236 -0.0380129 0.008008 -0.0491694 0.1442744 1.3633836 0.1498716 -0.1502327 0.0546328 1.3169652 -0.2226207 -0.1853686 -0.1243941 -0.1323569 -0.2076647 0.0961146 -0.0327265 0.1129438 0.1384245 -0.0296604 -0.0501112 -0.0787135 0.092196 0.3088196 -0.0461729 -0.0053244 -0.0672713 -0.0320597 0.0018468 -0.1925699 0.0376729 -0.092022 0.0519415 -0.0898721 0.0307295 -0.0272732 -0.0183754 -0.0207163 0.0099049 0.0903372 -0.1495492 -0.0209811 0.1143076 0.0266096 0.0761681 -0.0510675 -0.0044665 0.0473957 -0.0402225 0.0746918 0.0422564 0.0271367 0.039003 0.0256152 0.0996856 0.0507661 0.0069348 -0.0120173 -0.109162 0.0582377 -0.0399744 0.0134907 -0.0894047 -0.1700379 0.0100233 0.0065013 0.0194296 0.1003281 0.051107 -0.0026251 -0.0195015 -0.1154975 0.0632573 0.0964447 -0.0207569 0.0205881 0.0152455 0.0142009 0.02062 -0.0200829 0.0601973 -0.0993527 -0.0962078 -0.0457889 -0.0458274 0.0606817 -0.0912785 -0.0281468 -0.0671815 -0.0844046 0.0116683 0.0136749 -0.0871767 -0.0009231 0.0537406 0.053586 -0.0198277 0.0269236 -0.1153509 -0.0511642 0.0568805 0.0809938 0.0453463 -0.0932198 0.134013 0.0015637 0.0360333 -0.1022799 0.030426 -0.0775418 0.0797752 -0.0087926 0.1165017 0.0158958 -0.0342252 0.0373987 -0.0193791 0.0489904 0.096699 0.0266127 0.0577037 0.0105341 unknown
polarizability: 162.2857506|11.7670296|128.7456105|-4.2476348|-6.3307223|71.0261722 unknown
InChI: InChI=1S/C7H10N2S2/c8-3-1-4-9-5-2-6-11-7(9)10/h1-2,4-6H2
charge 0 multiplicity 1
21 atoms
S  -2.714859 1.113577 -0.012759
S  -0.127352 2.517808 -0.566393
N  -0.269863 -0.203977 -0.276891
N  4.615299 -0.306188 0.343844
C  -0.945933 -1.466572 0.130052
C  -2.307336 -1.6560 -0.567525
C  1.188455 -0.265474 -0.531862
C  -3.356988 -0.694832 -0.004132
C  -0.903826 1.018512 -0.296031
C  2.007606 0.042909 0.758736
C  3.449831 -0.142398 0.5408
H  -1.087136 -1.482897 1.231187
H  -0.269146 -2.297145 -0.131274
H  -2.184262 -1.506351 -1.655952
H  -2.647188 -2.698233 -0.413639
H  1.441039 0.481598 -1.303132
H  1.432906 -1.272501 -0.911681
H  -4.273304 -0.677175 -0.615582
H  -3.614052 -0.940271 1.039347
H  1.807793 1.090551 1.053633
H  1.684115 -0.613643 1.588056
