program: Gaussian 09
title: 000275658
version: EM64L-G09RevD.01
frameworkgroup: C1[X(C6H10N2OS2)]
method: RPBEPBE
basis: SDD
operation: Freq
keyword: #p
keyword: freq=noraman
keyword: PBEPBE/SDD
title: #p freq=noraman PBEPBE/SDD
converged: YES YES NO NO
title: Mulliken charges:
elementType: S S O N N C C C C C C H H H H H H H H H H
charge: 0.286414 0.017838 -0.258503 -0.001209 -0.601646 -0.281328 -0.417614 -0.695934 -0.483864 -0.490641 0.198606 0.250060 0.239475 0.278739 0.238098 0.289811 0.269981 0.251006 0.243334 0.331518 0.335858
chargesum: 0.00000
title: Mulliken charges with hydrogens summed into heavy atoms:
elementType: S S O N N C C C C C C
charge: 0.286414 0.017838 -0.258503 -0.001209 0.065729 0.208207 0.099224 -0.136141 0.010476 -0.490641 0.198606
polarizability: 1.45327436e+02 -9.68521203e+00 1.30726221e+02 -6.22127268e+00 -8.37883570e-01 6.53520919e+01
1716.lowfreq: -9.0908 -4.7587 0.0013 0.0022 0.0030 9.7026 54.1669 61.2707 66.3892
frequency: 53.9597 61.2524 66.3776 96.9437 131.5417 181.0014 191.2556 264.5825 324.6677 338.4188 413.3182 439.9827 513.7447 520.7794 553.8888 572.6914 588.9132 649.6582 665.6599 690.9485 785.4764 822.4402 873.2495 900.7676 974.1071 993.2271 1010.3514 1015.2041 1040.6574 1098.1907 1144.1352 1166.2192 1200.3556 1215.5004 1261.9339 1278.7615 1286.3326 1314.5598 1339.9465 1372.0188 1417.4143 1452.4298 1456.2926 1463.6963 1486.1485 1600.0183 1649.5152 2971.7630 3012.7708 3020.2888 3049.0832 3061.6757 3078.6011 3105.6019 3139.1059 3417.3109 3627.2314
redmass: 5.0723 6.1588 5.8692 4.2342 4.0797 2.3331 4.6085 5.4419 6.9833 3.3310 2.3586 5.2645 3.8787 5.4389 4.2430 2.8541 1.8303 3.3118 1.4288 1.9143 1.6120 2.0625 2.5485 3.0924 2.7133 2.0107 2.4578 2.2503 3.0916 1.8575 1.5244 1.4047 1.4737 1.7581 1.4009 1.3083 1.3593 1.4250 3.3868 1.2122 1.7964 1.0942 1.1471 1.1206 1.2281 1.3310 4.3477 1.0648 1.0618 1.0595 1.0757 1.0808 1.1034 1.1030 1.1091 1.0537 1.0973
irintensity: 2.0484 13.9917 9.8485 0.5171 0.5160 1.1739 1.2422 1.0405 4.2623 4.9469 12.1335 7.6427 7.1701 5.3570 8.6691 38.6081 93.7340 19.9788 133.6066 7.5616 5.4676 7.8453 44.2560 18.9580 50.0401 4.5279 2.3241 6.7619 33.4086 11.8827 56.1684 7.9621 4.6867 70.1949 62.3655 3.2223 40.8946 37.4914 91.7114 3.3665 75.2094 10.4468 20.1207 27.5309 40.5323 125.7653 319.1941 40.4594 3.1416 26.0832 5.9985 31.6745 2.2275 13.8054 8.3846 169.8820 95.9681
temp: 298.150 k
press: 1.00000 atm
elementType: 16 16 8 7 7 6 6 6 6 6 6 1 1 1 1 1 1 1 1 1 1
symmnumber: 1
zpe: 427198.2 jmol-1
zpe.correction: 0.162711 hartree
zpe.thermalcorrener: 0.174343 hartree
zpe.thermalcorrenthalpy: 0.175287 hartree
zpe.thermalcorrgfe: 0.123638 hartree
zpe.sumelectzpe: -1214.658494 hartree
zpe.sumelectthermal: -1214.646862 hartree
zpe.sumelectthermalent: -1214.645918 hartree
zpe.sumelectthermalfe: -1214.697567 hartree
dipole: 3.7298 -3.1100 0.8576
dipole: 4.9314
quadrupole: -94.3105 -79.0836 -80.4530
quadrupole: -21.5389 -1.9073 -0.5370
quadrupole: -9.6948 5.5321 4.1627 -21.5389 -1.9073 -0.5370
hfenergy: -1214.821205 hartree
pointgroup: C01 [X(C6H10N2O1S2)]
dipole: 1.5398568 -0.9536355 0.695467 debye
dipolederiv: -0.6313273 0.1733304 0.0102768 0.2380908 -0.0948035 -0.0205925 0.0913605 -0.0178398 0.0002905 -0.7000267 0.3510055 -0.087222 0.2790102 -0.6369288 0.1408198 -0.0655339 0.1335288 -0.2314735 -0.998556 -0.3704927 0.1150835 -0.2259259 -0.7288366 0.073354 0.1776919 0.1392562 -0.3960655 -0.817475 -0.0328506 0.089264 -0.0647961 -0.8487552 0.2894719 0.2132162 0.5378858 -0.5212882 -0.5343185 0.0655339 -0.0817738 -0.1580215 -1.0022695 0.0778258 -0.044056 0.0535025 -0.6470702 0.1707103 -0.204493 0.0768401 -0.1388373 0.3745892 0.0561951 0.0500946 0.0763334 0.2576418 0.6177006 0.2177466 -0.0633502 0.0994726 0.1032175 0.0444326 0.0364683 -0.1233078 0.2920242 -0.1085987 -0.0391522 0.0650176 -0.0949239 0.1566453 -0.0460557 0.1203731 -0.0577677 0.1953122 -0.4765254 0.0115327 0.0615503 0.074755 0.0719208 -0.0620115 -0.0385575 0.0146222 0.0267886 1.2291364 -0.3865789 -0.1175103 -0.4474197 1.0631682 -0.4947595 -0.2074569 -0.5978141 0.1539726 1.2677296 0.2142778 -0.1607595 0.1912836 1.3178115 -0.2192938 -0.3001754 -0.2849548 0.2175084 0.0263771 0.014577 -0.0699549 -0.0032187 -0.0972741 -0.0327107 -0.0388159 -0.1475717 -0.0263428 0.0818973 -0.0469366 0.066369 0.0069963 0.0002836 0.0696731 0.0195585 0.1100922 -0.0557641 0.024783 0.0035563 0.0157833 0.0462652 -0.021032 -0.0983101 -0.0219751 -0.0076986 0.0912175 0.0076649 -0.0082294 -0.039332 -0.0354886 0.0185817 0.1290834 -0.0267353 0.0819614 -0.0475323 0.0595614 -0.0302918 -0.0315759 0.007151 0.0175933 0.0003069 -0.1213572 0.0246827 -0.098361 0.0222538 0.0701887 0.0272964 0.1292686 -0.0225555 -0.0152441 0.0165734 -0.0225937 0.0684302 0.0448359 0.0168847 0.0512703 0.0166123 0.0663603 0.0793327 0.0684138 0.0337077 -0.0397851 0.0461898 0.004037 -0.0205213 -0.0028591 -0.0895833 -0.0227435 -0.0080393 0.0014412 0.0843791 0.1270556 -0.0020292 0.0433401 0.0002136 0.1899629 0.0221573 0.0537585 0.0299052 0.359737 0.5409317 -0.0216162 0.0499084 0.0823715 0.1619041 0.0290686 0.0251937 0.0226287 0.3163805 unknown
polarizability: 146.124765|-10.954525|120.8560016|-3.9656236|-22.1084818|74.4249816 unknown
InChI: InChI=1S/C6H10N2OS2/c7-5(9)1-2-8-3-4-11-6(8)10/h1-4,7H2
charge 0 multiplicity 1
21 atoms
S  2.95758 0.498691 -0.998837
S  0.289676 2.087003 -1.003887
O  -4.012473 -1.160373 -0.039774
N  0.751357 -0.357814 0.195177
N  -3.136371 0.941295 -0.548964
C  1.64928 -1.538538 0.268609
C  -0.659193 -0.456195 0.622284
C  3.093345 -1.016955 0.143766
C  -1.597443 -0.957667 -0.51853
C  1.191684 0.717531 -0.538093
C  -3.029473 -0.423724 -0.347909
H  1.410487 -2.242794 -0.554339
H  1.495189 -2.059276 1.229921
H  -0.965917 0.554372 0.942432
H  -0.71235 -1.127198 1.496774
H  3.501542 -0.680328 1.108639
H  3.762574 -1.753483 -0.322958
H  -1.195669 -0.596363 -1.482959
H  -1.646934 -2.057836 -0.541837
H  -4.048706 1.38453 -0.445304
H  -2.314586 1.504623 -0.798111
