program: Gaussian 09
title: 000275654
version: EM64L-G09RevD.01
frameworkgroup: C1[X(C6H8N2O3S)]
method: RPBEPBE
basis: SDD
operation: Freq
keyword: #p
keyword: freq=noraman
keyword: PBEPBE/SDD
title: #p freq=noraman PBEPBE/SDD
converged: YES YES NO NO
title: Mulliken charges:
elementType: S O O O N N C C C C C C H H H H H H H H
charge: 0.892552 -0.547747 -0.527221 -0.135490 -0.095977 0.004783 -0.320676 -0.617202 0.070563 -0.386024 -0.408484 -0.134753 0.276755 0.250425 0.295042 0.301330 0.283408 0.249933 0.288584 0.260200
chargesum: 0.00000
title: Mulliken charges with hydrogens summed into heavy atoms:
elementType: S O O O N N C C C C C C
charge: 0.892552 -0.547747 -0.527221 -0.135490 -0.095977 0.004783 0.206504 -0.020831 0.070563 0.147317 0.140300 -0.134753
polarizability: 1.53671314e+02 -1.07732735e+00 9.74100736e+01 5.35020739e+00 1.58694496e+00 8.39030733e+01
1716.lowfreq: -9.8217 0.0013 0.0021 0.0026 1.2746 11.3618 28.6607 37.8823 58.1046
frequency: 28.0349 37.8504 58.0902 95.1378 122.6031 142.6291 170.7286 187.3080 252.9472 272.6815 286.1515 346.0379 372.7028 382.4818 419.0123 468.7659 533.8049 549.3881 578.3183 664.3476 763.5554 793.3889 844.8982 871.4128 921.3274 945.4016 992.6152 1003.0867 1018.3424 1039.9407 1126.2143 1153.7673 1164.6497 1211.4032 1253.3394 1282.5172 1291.4479 1319.4434 1362.8981 1391.1462 1415.8311 1448.9542 1466.3169 1475.0577 1761.1426 2205.8742 3001.8171 3006.2141 3029.5875 3063.0071 3063.7308 3073.2754 3103.0957 3172.9378
redmass: 4.2793 10.1040 3.5305 5.5280 10.8613 6.5054 4.0161 8.1850 4.2216 3.8072 3.5540 4.4950 5.3890 5.2116 7.1734 6.0806 7.6749 6.3599 9.4019 3.0421 1.2959 6.8373 3.4196 2.1128 4.7501 4.6083 2.2605 1.8353 3.8067 2.0569 1.9282 1.7416 1.5082 1.7444 1.4387 1.2066 1.3193 1.2740 1.2512 1.5776 1.1239 1.0850 1.0808 1.1016 11.6111 12.4440 1.0599 1.0591 1.0596 1.0973 1.0951 1.0703 1.1070 1.1122
irintensity: 6.8950 3.7034 9.8914 2.2822 0.5206 6.9735 4.7742 10.0852 1.9715 2.9686 11.6823 9.1471 18.9900 21.6890 4.6766 12.2643 27.8113 24.2514 12.9095 6.5805 4.2060 73.8065 6.4497 66.5123 59.3979 1.3251 9.2749 13.0127 2.5628 6.1523 8.6844 58.1813 62.0860 120.8258 3.6491 25.8646 19.3468 10.8823 8.3414 14.8757 16.6131 5.0970 27.3587 16.8486 323.3011 8.2519 19.1245 3.8950 15.6158 1.6375 2.1925 4.1043 3.8750 0.0829
temp: 298.150 k
press: 1.00000 atm
elementType: 16 8 8 8 7 7 6 6 6 6 6 6 1 1 1 1 1 1 1 1
symmnumber: 1
zpe: 370882.2 jmol-1
zpe.correction: 0.141262 hartree
zpe.thermalcorrener: 0.154271 hartree
zpe.thermalcorrenthalpy: 0.155215 hartree
zpe.thermalcorrgfe: 0.099884 hartree
zpe.sumelectzpe: -965.573747 hartree
zpe.sumelectthermal: -965.560738 hartree
zpe.sumelectthermalent: -965.559793 hartree
zpe.sumelectthermalfe: -965.615124 hartree
dipole: -2.3924 5.7980 -2.1989
dipole: 6.6465
quadrupole: -120.6820 -76.2523 -80.4877
quadrupole: 6.5242 -4.8431 -3.4856
quadrupole: -28.2080 16.2217 11.9863 6.5242 -4.8431 -3.4856
hfenergy: -965.7150082 hartree
pointgroup: C01 [X(C6H8N2O3S1)]
dipole: -0.9451197 -2.3010524 0.8060456 debye
dipolederiv: 1.2227171 0.2429726 0.0029411 0.0705349 1.1103167 -0.0631622 -0.001783 -0.0846421 1.1720578 -0.5801402 -0.0011468 -0.0215874 0.0883963 -0.5150161 -0.0840063 0.2383975 0.0242627 -0.7141232 -0.8324936 -0.0537737 0.0047045 -0.0496839 -0.5020118 0.0126476 -0.2075016 -0.0623202 -0.4906732 -0.719381 0.378812 0.1260987 0.2924227 -1.1934305 -0.1449041 0.103687 -0.1127649 -0.2362146 -1.3061279 -0.098145 0.103335 -0.14297 -0.743106 -0.0216272 0.1977433 0.1066961 -0.3106594 -0.2876412 0.0034672 -0.0303015 -0.0071302 -0.2149773 0.0018366 0.0541411 0.0006373 -0.2094237 0.0904617 -0.0711298 -0.0347874 -0.1108373 0.3292137 0.0675597 0.0323943 0.0778591 0.2315019 -0.1639218 -0.025262 0.036698 0.0123227 -0.2509548 0.0479479 -0.0032251 0.0549097 -0.0685957 1.4047379 -0.2430281 -0.3117456 -0.0403793 1.5324028 0.1376918 -0.3116056 0.0688553 0.0759399 0.8022859 0.038141 0.0342907 -0.1434334 0.1583031 0.0066838 0.094017 -0.0814196 0.2787048 -0.1379103 -0.0049136 0.0319977 0.0081417 0.2057098 0.0164782 0.0023694 0.0345509 0.0823401 0.1654662 -0.0089192 -0.0323863 0.0074607 -0.0476619 0.002061 -0.1984148 0.0006272 -0.0669367 0.078058 0.0261083 -0.0314709 -0.0043166 0.0134018 0.0051376 -0.0665013 -0.0879626 -0.0542958 0.0120523 -0.1382282 0.0815738 -0.0443123 0.0274415 0.0319235 0.0659432 0.0650381 0.0465159 0.0582831 -0.047231 0.0043475 -0.0330872 0.0443382 0.0129788 -0.0247242 0.0139282 -0.0293435 0.0666796 0.018523 0.0173942 0.0619161 0.0195629 -0.0204151 0.0184952 -0.0267901 0.0779923 0.0461007 -0.0164947 -0.0249859 0.0590337 0.0158366 -0.0911482 -0.0259874 -0.0297875 0.049159 -0.0242876 -0.0018526 0.0025554 -0.0405742 -0.0293785 0.1078902 -0.0086071 0.0673477 0.038522 0.0581346 -0.0305651 0.0185943 -0.0131683 0.0276499 0.0599079 0.0218706 0.0253291 0.0795332 0.0469265 0.0326657 0.022734 0.0296639 0.01236 -0.0854815 0.0192914 -0.0543544 0.0479988 unknown
polarizability: 153.3372524|0.6931621|97.2501456|-7.2497702|2.1308552|84.397063 unknown
InChI: InChI=1S/C6H8N2O3S/c7-2-1-3-8-4-5-12(10,11)6(8)9/h1,3-5H2
charge 0 multiplicity 1
20 atoms
S  2.584328 0.04906 -0.314863
O  2.608592 -0.156398 -1.942533
O  3.852872 0.658985 0.503744
O  0.445981 2.021646 0.349288
N  -0.056048 -0.296938 0.424991
N  -4.942366 0.083834 -0.020303
C  0.509735 -1.652285 0.131883
C  2.012256 -1.649642 0.430291
C  0.70594 0.818515 0.246701
C  -1.500614 -0.149981 0.721111
C  -2.340096 -0.001917 -0.584571
C  -3.779878 0.049765 -0.285429
H  0.331562 -1.917528 -0.927518
H  -0.0129 -2.383821 0.772671
H  2.258044 -1.5957 1.500982
H  2.570928 -2.433488 -0.098588
H  -1.637056 0.744719 1.351349
H  -1.830265 -1.034489 1.293112
H  -2.043653 0.922984 -1.11289
H  -2.14806 -0.850724 -1.26713
