program: Gaussian 09
title: 000275647
version: EM64L-G09RevD.01
frameworkgroup: C1[X(C16H10F6O4)]
method: RPBEPBE
basis: SDD
operation: Freq
keyword: #p
keyword: freq=noraman
keyword: PBEPBE/SDD
title: #p freq=noraman PBEPBE/SDD
converged: YES YES NO NO
title: Mulliken charges:
elementType: F F F F F F O O O O C C C C C C C C C C C C C C C C H H H H H H H H H H
charge: -0.150615 -0.164942 -0.156106 -0.157939 -0.161532 -0.151958 -0.270372 -0.281015 -0.227276 -0.230198 0.403066 0.411066 0.209415 0.176099 -0.587991 -0.531385 -0.404518 -0.407439 0.161254 0.186103 -0.228573 -0.229905 -0.337532 -0.359776 0.414213 0.430889 0.276434 0.281716 0.252922 0.253978 0.238963 0.239140 0.279616 0.273599 0.273626 0.276970
chargesum: 0.00000
title: Mulliken charges with hydrogens summed into heavy atoms:
elementType: F F F F F F O O O O C C C C C C C C C C C C C C C C
charge: -0.150615 -0.164942 -0.156106 -0.157939 -0.161532 -0.151958 -0.270372 -0.281015 -0.227276 -0.230198 0.403066 0.411066 0.209415 0.176099 -0.311557 -0.249669 -0.151595 -0.153461 0.161254 0.186103 0.010390 0.009235 0.215684 0.190820 0.414213 0.430889
polarizability: 2.49140911e+02 5.60292698e+01 2.48120181e+02 4.19312507e+01 -6.38795181e+00 1.19585519e+02
1716.lowfreq: -3.6398 0.0006 0.0008 0.0009 4.2154 6.7962 7.7078 16.1555 27.7650
frequency: 7.2078 16.1417 27.7578 30.1855 35.9155 41.3143 43.7400 71.5576 77.4600 96.8819 110.4645 139.8157 192.1045 200.0915 229.8390 231.7023 249.5063 263.3664 269.1993 288.1402 328.6195 334.8881 337.1154 353.3847 393.6941 403.5739 424.2142 461.7683 463.9914 478.1591 481.5685 492.0283 523.6687 563.1891 573.7159 583.6403 585.7945 607.5645 631.7917 645.5975 703.5684 725.5047 741.5501 762.3120 768.2603 769.9047 780.5452 791.8594 798.2587 872.5709 877.4156 905.2500 905.7178 926.1270 931.5256 951.0418 965.6998 980.3232 1002.7290 1012.6595 1024.0115 1025.7513 1031.5610 1055.7085 1112.0546 1112.8177 1127.0046 1177.7394 1180.0905 1207.2637 1217.4678 1225.2916 1253.2177 1254.9585 1264.8463 1271.1733 1283.2478 1324.3085 1363.4951 1365.7722 1407.5606 1431.6260 1438.0772 1442.6514 1453.2003 1465.1664 1506.0168 1574.8922 1595.3658 1630.9126 1645.6483 1647.1455 3032.9544 3039.8552 3107.3491 3121.9224 3131.2990 3136.7034 3147.4171 3152.0296 3164.1353 3169.4790
redmass: 12.1651 9.5372 10.1858 9.9667 11.3587 11.8359 13.1472 5.1394 8.3971 6.4350 8.7726 7.3337 8.5200 6.7215 10.6756 9.7020 9.0604 6.4430 11.7970 8.3954 3.2810 3.3457 6.0476 7.7170 6.0602 4.9047 7.0556 6.9512 7.0615 9.4517 2.5985 7.8395 5.1242 7.5156 7.2352 10.1858 5.4950 7.7555 6.6840 7.1230 7.2591 6.5280 7.5391 5.1379 5.4361 1.4272 5.4528 2.6965 4.9567 2.1973 2.3048 3.2363 3.0470 5.8543 1.4981 1.8624 4.4010 1.4718 1.3607 8.3801 2.5290 7.3813 9.9241 5.3453 2.5128 2.5033 2.0627 1.0812 2.5147 1.9238 3.3949 4.7131 1.5157 1.5474 1.2606 3.5995 1.8994 2.0117 1.3957 1.5075 5.9749 4.6529 2.6419 1.1103 1.0950 3.1295 3.9916 7.1141 6.0799 7.4517 10.6559 10.9463 1.0567 1.0584 1.1071 1.1058 1.0863 1.0896 1.0923 1.0954 1.0923 1.1005
irintensity: 0.7367 1.3202 1.4047 0.8984 0.0237 0.0575 1.6412 0.5938 1.2387 3.4274 0.8333 1.8716 1.4596 1.9520 4.4312 0.3107 2.1082 2.9309 1.8047 10.3725 1.9457 3.5167 3.1568 1.5875 18.6825 10.8971 2.8451 0.7795 0.9711 10.3174 18.4947 31.2022 7.9280 2.8900 0.3251 32.8961 2.6169 13.6917 0.6169 0.7709 6.6641 5.0093 5.3221 9.9946 39.4601 62.0322 19.8706 6.6289 26.7429 7.4389 8.7405 129.5391 70.8887 10.1082 28.4912 4.1835 1.2261 14.5350 0.0867 127.6808 33.6324 248.6892 241.9901 671.4807 72.4960 27.8818 117.4626 1.7982 128.9483 128.9802 138.8506 103.8553 32.3729 18.4628 58.6324 106.8747 49.0437 11.4651 75.2125 79.4618 18.6690 2.3496 20.1901 20.0648 20.3950 60.7735 6.3157 2.5178 10.8471 60.7360 308.4990 116.9997 29.7598 32.0090 1.9190 0.5423 1.2627 0.2701 0.0499 19.1359 0.2107 28.9176
temp: 298.150 k
press: 1.00000 atm
elementType: 9 9 9 9 9 9 8 8 8 8 6 6 6 6 6 6 6 6 6 6 6 6 6 6 6 6 1 1 1 1 1 1 1 1 1 1
symmnumber: 1
zpe: 614775.1 jmol-1
zpe.correction: 0.234155 hartree
zpe.thermalcorrener: 0.257576 hartree
zpe.thermalcorrenthalpy: 0.258520 hartree
zpe.thermalcorrgfe: 0.175300 hartree
zpe.sumelectzpe: -1513.798534 hartree
zpe.sumelectthermal: -1513.775113 hartree
zpe.sumelectthermalent: -1513.774169 hartree
zpe.sumelectthermalfe: -1513.857390 hartree
dipole: -3.3854 -2.3029 -1.0675
dipole: 4.2313
quadrupole: -146.3766 -134.8521 -155.5401
quadrupole: 22.8952 9.4412 -1.6370
quadrupole: -0.7870 10.7375 -9.9505 22.8952 9.4412 -1.6370
hfenergy: -1514.0326893 hartree
pointgroup: C01 [X(C16H10F6O4)]
dipole: 1.5427997 0.3768274 -0.4991185 debye
polarizability: 281.5820637|41.0683868|214.72731|-45.7152504|12.9160543|120.5372382 unknown
InChI: InChI=1S/C16H10F6O4/c17-15(18,19)7-25-13(23)11-5-9-3-1-2-4-10(9)6-12(11)14(24)26-8-16(20,21)22/h1-6H,7-8H2
charge 0 multiplicity 1
36 atoms
F  -3.902302 2.874523 -1.111879
F  -5.669885 1.847261 -0.111329
F  -4.308858 0.680626 -1.50614
F  1.208298 -4.792298 -0.623155
F  -0.450309 -5.726051 0.617553
F  0.917517 -4.150169 1.529308
O  -2.093796 1.117333 0.279415
O  -0.050082 -2.202131 -0.36865
O  -1.379474 2.630815 1.916115
O  -1.135991 -1.20293 1.448942
C  2.526689 2.135819 0.006603
C  2.861429 0.794954 -0.425669
C  0.258335 1.369881 0.608678
C  0.608109 0.019422 0.226869
C  1.213704 2.385799 0.517087
C  1.882755 -0.239175 -0.29214
C  3.510312 3.171192 -0.10238
C  4.168335 0.535716 -0.952587
C  -1.109253 1.775168 1.0474
C  -0.295374 -1.125303 0.528937
C  4.777777 2.89019 -0.620067
C  5.108462 1.56497 -1.049175
C  -3.48152 1.302632 0.711257
C  -0.769015 -3.448592 -0.094938
C  -4.318244 1.673612 -0.505115
C  0.228963 -4.512736 0.353726
H  0.935889 3.400296 0.823746
H  2.142561 -1.264132 -0.573358
H  3.2560 4.185703 0.224834
H  4.420322 -0.480235 -1.277121
H  5.52665 3.685106 -0.700917
H  6.105869 1.362507 -1.453224
H  -3.54945 2.1053 1.466398
H  -3.842667 0.347234 1.126433
H  -1.242901 -3.773777 -1.03377
H  -1.522556 -3.298931 0.698116
