program: Gaussian 09
title: 000275645
version: EM64L-G09RevD.01
frameworkgroup: C1[X(C21H19NO)]
method: RPBEPBE
basis: SDD
operation: Freq
keyword: #p
keyword: freq=noraman
keyword: PBEPBE/SDD
title: #p freq=noraman PBEPBE/SDD
converged: YES YES NO NO
title: Mulliken charges:
elementType: O N C C C C C C C C C C C C C C C C C C C C C H H H H H H H H H H H H H H H H H H H
charge: -0.270431 -0.483417 0.127982 0.357347 0.447064 -0.771925 -0.384638 -0.365992 -0.423847 -0.385585 0.190805 -0.242429 -0.250491 -0.243250 -0.247068 0.252061 -0.241371 -0.243824 -0.349752 -0.367152 -0.224550 -0.238708 -0.228795 0.222028 0.280681 0.227973 0.317721 0.262830 0.233404 0.256314 0.240847 0.228373 0.224278 0.227444 0.223237 0.231197 0.226636 0.276518 0.216586 0.231824 0.228320 0.231754
chargesum: 0.00000
title: Mulliken charges with hydrogens summed into heavy atoms:
elementType: O N C C C C C C C C C C C C C C C C C C C C C
charge: -0.270431 -0.165696 0.127982 0.357347 0.447064 -0.041242 -0.121808 -0.132588 -0.167533 -0.144738 0.190805 -0.014055 -0.026214 -0.015806 -0.023831 0.252061 -0.010175 -0.017188 -0.073234 -0.150566 0.007274 -0.010388 0.002959
polarizability: 2.64251713e+02 -8.90480312e+00 2.58803224e+02 -5.95677738e+00 9.04290634e+00 1.61402670e+02
1716.lowfreq: -10.9413 -6.5845 -0.0002 0.0004 0.0006 5.1624 13.0338 28.0519 31.7466
frequency: 12.7908 27.9594 31.5518 43.5175 49.8607 70.1347 80.9717 135.0824 167.3277 193.6405 201.7661 237.3125 254.5697 280.0264 293.8677 303.8005 317.4394 349.8585 400.7895 401.7091 403.9689 412.5960 437.9832 489.1998 491.2966 529.1692 564.5677 591.3117 607.0258 614.6940 616.7258 617.6144 667.1336 690.0816 701.0814 703.9242 709.5301 714.8810 766.4859 770.8533 792.9586 805.3623 849.8524 855.1641 858.1495 881.7513 912.3098 926.0550 928.4493 936.4525 975.0997 982.2448 983.8708 989.4400 990.0702 991.2966 994.0231 998.1044 1005.4466 1024.2877 1025.4417 1026.0346 1062.4260 1070.4062 1080.2948 1083.0528 1092.2783 1105.3484 1149.6958 1172.8081 1173.1206 1173.4080 1189.5647 1193.3926 1195.4138 1197.3514 1224.6123 1271.5287 1315.4975 1319.5301 1321.1692 1375.5183 1379.1940 1383.1202 1384.3427 1430.5184 1433.4386 1435.3361 1451.3023 1469.8473 1480.1723 1483.7185 1486.2204 1487.2773 1573.1823 1588.6075 1592.8784 1605.4709 1609.4891 1610.9275 1614.0079 3000.1995 3095.5136 3114.5998 3116.2369 3119.3003 3120.3871 3128.7075 3128.7715 3130.2242 3140.7190 3141.7583 3143.3483 3154.9734 3156.3125 3157.1342 3166.8588 3168.5075 3168.8113 3539.4562
redmass: 3.9401 4.1001 4.5969 4.2283 5.3742 4.8743 5.6253 4.9374 4.8349 3.4936 5.5176 3.7417 3.8870 3.5026 1.3384 4.9188 3.2510 3.6764 2.7937 2.8606 2.8474 4.8186 4.1900 4.0625 3.6259 1.2327 3.2291 4.1172 5.0872 6.3248 6.4224 6.0925 6.0898 4.6951 1.6866 1.5796 1.7257 3.9312 2.3069 1.9195 2.4075 3.6098 1.2553 1.2519 1.2439 2.8520 2.6083 1.5424 1.4190 1.5295 1.3989 1.4322 1.4117 5.5535 5.2053 4.8254 1.3922 1.3186 1.3434 2.5817 2.3220 2.4840 2.8489 1.6903 1.7401 1.6119 1.7805 2.0737 3.4143 1.0601 1.0510 1.0508 1.1319 1.1467 1.1540 2.5826 3.2690 2.8684 1.3355 1.3576 1.3327 6.5935 6.0360 1.2979 8.7093 2.1621 2.2144 2.2296 1.7233 1.2846 1.9090 1.9293 1.2445 1.8403 6.4525 6.0856 6.1224 6.7247 6.0637 6.1839 6.1016 1.0352 1.0993 1.0874 1.0866 1.1013 1.0849 1.0870 1.0875 1.0868 1.0927 1.0934 1.0921 1.0951 1.0961 1.0956 1.1002 1.1004 1.0985 1.0772
irintensity: 0.2445 0.3969 0.1685 0.0774 2.6688 0.4054 3.2749 1.5069 0.9113 4.6007 1.7264 0.9575 1.0097 2.3482 0.3019 2.8688 5.8268 0.5588 0.6533 0.4183 0.2439 3.1618 0.8362 4.7487 2.7482 77.4079 7.0003 42.5059 15.1469 1.2396 0.1454 2.8602 1.8316 5.6332 72.4456 56.1180 69.4768 10.2741 23.4075 42.1805 19.8828 2.5928 0.1367 1.4131 0.4933 10.2473 1.4650 7.1575 1.6457 2.3330 0.0772 0.6591 1.4370 0.7419 0.1785 1.2089 0.3188 0.2921 1.5885 14.5541 7.7473 15.1438 7.9139 8.4998 20.7490 8.8719 2.9870 4.2630 20.6199 1.6252 0.2409 0.1269 10.4646 5.9165 6.4615 30.3679 19.6628 114.2457 3.0624 4.4365 0.4956 10.6267 5.6329 27.2611 1.4537 33.9655 16.7535 10.9325 335.5567 39.1677 36.6709 6.3220 46.3022 57.6552 70.3640 1.2654 1.0008 56.4222 6.3506 6.2311 6.7147 18.7775 26.4430 13.4876 10.9959 7.1227 4.5983 1.1644 1.9544 1.6842 24.3466 33.6368 23.7932 27.4810 31.8749 16.8648 20.5284 27.1549 9.5048 16.6007
temp: 298.150 k
press: 1.00000 atm
elementType: 8 7 6 6 6 6 6 6 6 6 6 6 6 6 6 6 6 6 6 6 6 6 6 1 1 1 1 1 1 1 1 1 1 1 1 1 1 1 1 1 1 1
symmnumber: 1
zpe: 890280.4 jmol-1
zpe.correction: 0.339090 hartree
zpe.thermalcorrener: 0.358782 hartree
zpe.thermalcorrenthalpy: 0.359726 hartree
zpe.thermalcorrgfe: 0.288214 hartree
zpe.sumelectzpe: -940.021302 hartree
zpe.sumelectthermal: -940.001610 hartree
zpe.sumelectthermalent: -940.000666 hartree
zpe.sumelectthermalfe: -940.072177 hartree
dipole: -0.5080 -2.7533 -2.1400
dipole: 3.5240
quadrupole: -119.3197 -123.4206 -136.3711
quadrupole: -5.5981 -5.2422 -2.0780
quadrupole: 7.0508 2.9498 -10.0006 -5.5981 -5.2422 -2.0780
hfenergy: -940.3603916 hartree
pointgroup: C01 [X(C21H19N1O1)]
dipole: 0.3221239 -1.0521787 0.8434253 debye
polarizability: 262.180809|8.7590386|260.0814893|-9.0873723|-11.0663006|162.1953084 unknown
InChI: InChI=1S/C21H19NO/c1-21(18-13-7-3-8-14-18,19-15-9-4-10-16-19)22-20(23)17-11-5-2-6-12-17/h2-16,22H,1H3
charge 0 multiplicity 1
42 atoms
O  -1.629699 1.299476 -1.437742
N  -0.453813 -0.392396 -0.339027
C  0.913836 0.002462 -0.804447
C  1.885814 -1.093854 -0.285828
C  1.270355 1.395841 -0.225926
C  0.951102 -0.023827 -2.360991
C  3.13316 -0.776391 0.305024
C  0.978388 1.680142 1.133313
C  1.554232 -2.464158 -0.470197
C  1.927656 2.388121 -0.99136
C  -1.61845 0.278362 -0.680028
C  4.020435 -1.79944 0.711303
C  1.323188 2.920481 1.709052
C  2.435334 -3.486983 -0.05731
C  2.275828 3.633718 -0.419407
C  -2.894301 -0.273547 -0.084568
C  3.675375 -3.158143 0.537522
C  1.976981 3.906539 0.93339
C  -4.013462 0.595835 -0.03207
C  -3.030436 -1.605464 0.38859
C  -5.239775 0.152071 0.504095
C  -4.260256 -2.051351 0.92155
C  -5.366106 -1.172343 0.986739
H  1.982032 0.124235 -2.725445
H  0.288858 0.752787 -2.774008
H  0.609384 -1.009678 -2.718608
H  -0.498087 -1.111206 0.38513
H  3.412312 0.271188 0.453264
H  0.466769 0.927378 1.744276
H  0.608621 -2.734518 -0.955942
H  2.158283 2.207704 -2.045245
H  4.9805 -1.531981 1.166926
H  1.080493 3.119549 2.759106
H  2.158951 -4.536905 -0.206851
H  2.774904 4.391197 -1.034469
H  4.362548 -3.949388 0.857149
H  2.242737 4.873125 1.375836
H  -3.893878 1.610349 -0.426129
H  -2.198488 -2.316887 0.313236
H  -6.09623 0.834001 0.544606
H  -4.358647 -3.083496 1.275647
H  -6.319347 -1.519302 1.400946
