program: Gaussian 09
title: 000277491
version: EM64L-G09RevD.01
frameworkgroup: C1[X(C17H17N3O)]
method: RPBEPBE
basis: SDD
operation: Freq
keyword: #p
keyword: freq=noraman
keyword: PBEPBE/SDD
title: #p freq=noraman PBEPBE/SDD
converged: YES YES NO NO
title: Mulliken charges:
elementType: O N N N C C C C C C C C C C C C C C C C C H H H H H H H H H H H H H H H H H
charge: -0.259776 -0.148396 -0.037087 -0.036890 0.415755 -0.332263 -0.366455 0.182888 -0.413256 -0.257093 0.329796 -0.644483 -0.645255 0.010699 -0.309363 -0.390893 0.323087 -0.366584 -0.345950 -0.261196 -0.537210 0.239688 0.240287 0.252220 0.251954 0.239347 0.239369 0.220020 0.240832 0.219858 0.240777 0.249848 0.272140 0.251660 0.239795 0.222992 0.223066 0.246073
chargesum: 0.00000
title: Mulliken charges with hydrogens summed into heavy atoms:
elementType: O N N N C C C C C C C C C C C C C C C C C
charge: -0.259776 -0.148396 -0.037087 -0.036890 0.415755 -0.092575 -0.126168 0.182888 -0.161036 -0.005139 0.329796 0.054253 0.056212 0.010699 -0.059515 -0.118753 0.323087 -0.114924 -0.106155 -0.261196 0.154920
polarizability: 5.72405650e+02 -1.87203137e+01 2.19928646e+02 1.52188102e-02 7.68385112e-02 9.47626306e+01
1716.lowfreq: -2.7907 -0.0005 -0.0002 0.0008 7.7931 10.1365 22.2893 31.9705 47.7674
frequency: 22.2334 31.8249 47.7640 54.5223 68.4608 75.2721 111.4687 126.8880 132.3830 146.3950 158.1131 199.0244 207.2226 216.1685 224.6451 249.0554 287.7626 291.9334 358.0872 365.2865 380.4102 405.1787 417.0067 431.6341 445.6566 473.6353 480.1909 509.7809 538.0378 539.4516 597.4559 622.8258 629.5680 676.8545 696.9377 727.3884 743.6418 748.0224 772.0580 802.2552 823.2990 827.5730 830.0477 844.2307 942.2941 959.6885 965.9914 966.8441 982.4129 982.6136 986.7004 989.5641 1009.5027 1056.4233 1105.0864 1110.9428 1111.9552 1112.4160 1132.4069 1156.8503 1167.4032 1171.0568 1180.9649 1222.7147 1231.3046 1257.9195 1285.9195 1303.7401 1312.2627 1365.5309 1370.6946 1375.3332 1426.6675 1431.3307 1436.6740 1455.9515 1458.8672 1465.5081 1467.4239 1472.0264 1477.9664 1493.1158 1497.5797 1502.8489 1504.6631 1522.5485 1539.2802 1573.2589 1617.8168 1630.3046 2127.6237 2949.4100 2956.1535 2962.2105 3018.1919 3021.3114 3051.4310 3101.8639 3111.6187 3127.0158 3138.7685 3148.2921 3149.1012 3158.6059 3167.4255 3170.6698 3172.0964 3187.9645
redmass: 3.5339 4.7044 4.7430 5.1009 4.0694 2.2975 3.8379 1.7837 7.5596 6.2479 2.3733 1.1291 5.2373 1.5096 3.6914 1.8781 3.9620 4.4633 7.1207 5.1798 5.7842 4.7710 3.0220 3.5743 4.1730 4.0346 4.1892 2.6254 4.3153 2.3023 5.8966 7.3310 7.1071 5.4973 6.2423 7.3088 3.8657 4.2170 6.1867 1.2562 1.2523 6.8848 1.8157 1.6920 3.1544 1.3752 1.3510 1.3564 1.3526 7.4771 5.8672 3.1438 2.6817 1.5095 1.2371 1.2601 1.3273 1.3729 1.4431 1.3652 1.7356 1.2810 1.9224 1.5363 2.9751 2.8258 3.8216 1.3057 1.5409 3.3553 3.4036 5.2044 3.4829 1.1968 1.2551 2.4071 1.3821 1.0398 1.0500 1.0774 1.0454 1.1420 2.1050 8.0629 1.3862 2.1255 5.9008 7.2941 6.2948 6.3636 12.6752 1.0366 1.0390 1.0328 1.0997 1.1027 1.1041 1.0967 1.0947 1.0996 1.0889 1.0875 1.0871 1.0877 1.0953 1.0962 1.0956 1.0941
irintensity: 1.5434 0.4651 0.2426 2.1324 0.0707 0.0682 10.1421 0.1025 0.9340 5.2179 1.7615 0.0826 0.8754 0.7685 1.0216 3.4377 0.0325 5.7353 3.0861 5.3828 14.7892 0.0699 0.0156 0.0135 11.3258 3.9972 11.8265 1.1507 20.5235 40.0467 22.7285 1.2281 4.1040 2.8883 6.3944 3.6531 2.4482 2.2436 6.8848 0.0534 0.0099 3.7553 82.2929 79.4128 38.0167 0.6067 0.1734 0.3930 1.5185 113.5183 3.4349 7.9301 4.1717 25.9018 0.0027 0.2318 1.0255 15.7953 21.6625 1.7525 5.8804 222.7642 79.8423 64.9677 272.9725 33.9764 218.7592 5.8210 0.7048 59.3116 244.3955 35.9530 5.8155 6.8054 19.1206 13.2467 38.1811 0.1005 13.6332 74.5615 23.6744 0.7530 73.9173 152.3663 4.9011 235.9461 102.0582 2.9794 394.3809 423.6005 95.4764 88.3586 216.3722 86.5972 7.4210 69.4792 47.3061 3.6630 49.2316 31.7328 4.3652 6.5308 6.3705 14.2695 11.0311 17.8131 20.3372 7.9660
temp: 298.150 k
press: 1.00000 atm
elementType: 8 7 7 7 6 6 6 6 6 6 6 6 6 6 6 6 6 6 6 6 6 1 1 1 1 1 1 1 1 1 1 1 1 1 1 1 1 1
symmnumber: 1
zpe: 788624.8 jmol-1
zpe.correction: 0.300371 hartree
zpe.thermalcorrener: 0.320566 hartree
zpe.thermalcorrenthalpy: 0.321510 hartree
zpe.thermalcorrgfe: 0.249955 hartree
zpe.sumelectzpe: -895.944364 hartree
zpe.sumelectthermal: -895.924169 hartree
zpe.sumelectthermalent: -895.923225 hartree
zpe.sumelectthermalfe: -895.994780 hartree
dipole: 4.5235 -4.9321 0.0061
dipole: 6.6924
quadrupole: -63.9741 -121.3954 -129.4686
quadrupole: 9.5249 0.0671 0.0185
quadrupole: 40.9719 -16.4493 -24.5226 9.5249 0.0671 0.0185
hfenergy: -896.2447351 hartree
pointgroup: C01 [X(C17H17N3O1)]
dipole: -1.7753093 1.7189397 0.9089443 debye
polarizability: 572.2943002|-15.6796527|193.4171339|-12.130157|51.2168437|121.3854927 unknown
InChI: InChI=1S/C17H17N3O/c1-20(2)15-8-6-14(7-9-15)19-17(12-18)13-4-10-16(21-3)11-5-13/h4-11H,1-3H3
charge 0 multiplicity 1
38 atoms
O  6.448338 0.327391 0.038896
N  -5.709633 0.33286 0.141019
N  -0.040037 0.073201 -0.050123
N  0.280059 -3.094951 -1.691996
C  -4.321547 0.235434 0.075568
C  -3.474204 1.267181 0.600442
C  -3.682864 -0.90383 -0.52075
C  -1.43897 0.018871 -0.06619
C  -2.082784 1.150487 0.525577
C  -2.289006 -1.010298 -0.590261
C  2.303954 -0.488787 -0.357675
C  -6.338364 1.509932 0.757513
C  -6.554362 -0.739436 -0.40607
C  0.857077 -0.79067 -0.504176
C  3.307071 -1.38648 -0.827471
C  2.718522 0.719576 0.263885
C  5.065462 0.124417 -0.057717
C  4.670184 -1.086464 -0.6806
C  4.081332 1.032483 0.417134
C  0.542737 -2.055689 -1.156118
C  6.912614 1.564564 0.673148
H  -3.906222 2.157014 1.065793
H  -4.28596 -1.716881 -0.934565
H  -1.435996 1.937718 0.926398
H  -1.864127 -1.902288 -1.056125
H  -6.064116 2.44474 0.228828
H  -6.047536 1.619401 1.821507
H  -7.433448 1.405083 0.714566
H  -6.385316 -0.880335 -1.49227
H  -7.614478 -0.481459 -0.258789
H  -6.365487 -1.707637 0.099027
H  3.01682 -2.325909 -1.311199
H  1.942694 1.403073 0.621985
H  5.445696 -1.770051 -1.038449
H  4.366948 1.971766 0.900127
H  6.573947 1.628441 1.725339
H  6.565811 2.45621 0.115855
H  8.010395 1.509127 0.639137
