program: Gaussian 09
title: 000275640
version: EM64L-G09RevD.01
frameworkgroup: C1[X(C17H16O2)]
method: RPBEPBE
basis: SDD
operation: Freq
keyword: #pfreq=noraman
keyword: PBEPBE/SDD
title: #p freq=noraman PBEPBE/SDD
converged: YES YES NO NO
title: Mulliken charges:
elementType: O O C C C C C C C C C C C C C C C C C H H H H H H H H H H H H H H H H
charge: -0.279977 -0.239724 0.018532 -0.332260 -0.602512 0.479817 0.482696 0.226296 -0.406888 -0.413071 -0.414510 -0.432505 -0.229107 -0.225683 -0.230833 -0.237719 -0.241763 -0.240191 -0.505866 0.286688 0.268454 0.251131 0.232097 0.236373 0.231420 0.249739 0.223101 0.225571 0.223574 0.226599 0.226433 0.228959 0.241015 0.230721 0.243393
chargesum: 0.00000
title: Mulliken charges with hydrogens summed into heavy atoms:
elementType: O O C C C C C C C C C C C C C C C C C
charge: -0.279977 -0.239724 0.018532 -0.045572 -0.082927 0.479817 0.482696 0.226296 -0.174791 -0.176698 -0.183089 -0.182766 -0.006006 -0.000112 -0.007259 -0.011121 -0.015330 -0.011232 0.209263
polarizability: 1.98701951e+02 -1.25386102e+01 1.78861468e+02 2.10543501e+00 1.88905217e+01 1.61434914e+02
1716.lowfreq: -5.3131 -1.6474 -0.0005 -0.0004 0.0005 7.4179 23.4074 32.0451 38.0438
frequency: 23.3703 32.0038 38.0167 56.2831 57.8173 69.5033 89.6321 137.9803 168.7533 202.7735 218.1469 246.8431 261.4219 288.7233 343.6999 373.0334 400.7882 402.7659 404.5752 471.5766 547.4728 556.9659 589.0853 615.1664 616.7390 651.8609 678.4141 700.4967 708.1631 728.6377 757.4545 776.7238 809.3181 830.3533 848.9464 855.1536 868.0484 900.1397 921.6397 926.4988 973.5272 977.3274 982.9917 989.6320 991.1659 993.3315 995.4694 1000.5010 1021.5443 1027.6637 1064.5563 1080.8298 1083.1865 1104.0377 1109.5076 1113.6935 1131.3228 1143.4984 1149.4600 1172.3725 1172.5956 1187.5146 1191.1032 1269.5950 1304.3486 1314.2982 1319.2480 1372.3940 1377.6652 1385.0918 1424.1917 1432.6606 1435.4480 1451.1274 1454.9347 1464.9310 1483.1850 1485.5001 1587.6960 1590.6013 1610.2525 1613.2982 1639.8805 3002.5344 3102.9077 3103.6297 3119.9013 3120.4717 3123.8593 3125.4363 3136.2098 3137.5243 3145.8622 3146.2172 3146.8076 3162.9965 3163.3257 3164.7738 3208.9252
redmass: 3.7937 4.5202 3.8792 4.6163 5.0280 3.0050 1.3275 4.0775 4.4481 4.8201 3.9864 4.8698 3.9899 4.4041 3.8334 4.7598 2.9550 3.0042 3.5130 3.7017 3.3499 4.6203 4.5569 6.4377 6.4017 3.9166 5.9372 1.8131 1.6438 4.5842 1.9580 2.1198 3.0343 2.2749 1.2732 1.2980 4.8795 4.7236 1.4496 1.5356 1.4102 1.4425 1.5269 5.7685 5.3617 1.3732 1.5578 3.4106 2.4284 2.2795 1.6450 1.5918 1.5013 1.4327 1.7875 1.3672 2.1231 1.8855 1.4751 1.0518 1.0515 1.1114 1.1154 2.8226 2.8924 1.4028 1.3545 4.8758 6.4177 2.4492 1.2626 2.1909 2.1796 1.0504 1.2641 1.0530 2.3578 2.3651 6.0972 6.1501 6.1051 6.1106 9.4733 1.0295 1.0566 1.1035 1.0847 1.0847 1.0874 1.0871 1.0918 1.0920 1.1047 1.0964 1.0964 1.1015 1.1015 1.0900 1.1161
irintensity: 0.0234 1.1829 0.0146 0.2510 1.3156 0.0966 0.5253 2.0111 1.2401 6.2034 2.0562 0.8864 2.4168 10.6235 6.9261 3.1947 0.0970 0.2850 0.3890 3.6020 31.3198 0.4352 10.0457 0.0354 0.3090 5.2716 1.9176 34.7871 75.9582 14.1945 33.8923 30.6276 14.4129 5.9391 0.6446 1.3254 28.2434 12.0649 0.5595 2.3342 0.5127 1.8463 7.5672 0.4469 0.7786 0.3876 1.2148 1.4375 16.1159 4.6661 10.3882 5.0791 4.8159 9.2503 112.9095 26.3636 160.8415 83.6584 0.7970 0.0929 0.0338 0.6050 0.9983 21.8190 10.7995 0.7429 5.3184 19.4286 5.5528 66.9816 53.9116 0.2578 8.3236 14.5604 26.1769 10.3218 13.5122 16.7877 2.7153 2.0678 12.2351 4.5071 140.3928 38.4345 4.8427 28.3437 6.0687 3.6896 0.0821 0.0811 18.5548 13.9533 14.9530 10.0548 67.4426 34.0519 15.3982 2.1166 5.6879
temp: 298.150 k
press: 1.00000 atm
elementType: 8 8 6 6 6 6 6 6 6 6 6 6 6 6 6 6 6 6 6 1 1 1 1 1 1 1 1 1 1 1 1 1 1 1 1
symmnumber: 1
zpe: 735461.4 jmol-1
zpe.correction: 0.280122 hartree
zpe.thermalcorrener: 0.297290 hartree
zpe.thermalcorrenthalpy: 0.298235 hartree
zpe.thermalcorrgfe: 0.232574 hartree
zpe.sumelectzpe: -806.482157 hartree
zpe.sumelectthermal: -806.464989 hartree
zpe.sumelectthermalent: -806.464045 hartree
zpe.sumelectthermalfe: -806.529705 hartree
dipole: 0.8921 -0.6442 -0.9013
dipole: 1.4224
quadrupole: -105.1456 -104.2931 -103.0446
quadrupole: 2.0880 6.7111 4.7237
quadrupole: -0.9845 -0.1320 1.1165 2.0880 6.7111 4.7237
hfenergy: -806.7622792 hartree
pointgroup: C01 [X(C17H16O2)]
dipole: -0.3640995 -0.1752125 0.3871809 debye
polarizability: 201.3471929|8.7743408|172.5794986|-2.6585616|-20.383671|165.0716414 unknown
InChI: InChI=1S/C17H16O2/c1-19-16(18)15-12-17(15,13-8-4-2-5-9-13)14-10-6-3-7-11-14/h2-11,15H,12H2,1H3
charge 0 multiplicity 1
35 atoms
O  2.130976 -2.653338 0.703967
O  2.845293 -1.137907 -0.921929
C  -0.251345 -0.252864 -0.629244
C  0.459903 -1.650776 -0.646319
C  0.029846 -0.961075 -1.950531
C  0.537854 0.987554 -0.251565
C  -1.682925 -0.247198 -0.117769
C  1.913767 -1.751161 -0.349689
C  0.807399 1.257198 1.115277
C  -2.655594 0.536957 -0.790017
C  0.966849 1.918518 -1.227472
C  -2.065224 -0.961163 1.04481
C  1.497865 2.427118 1.495746
C  -3.982837 0.601192 -0.314014
C  1.6548 3.093601 -0.849667
C  -3.393926 -0.898658 1.523634
C  1.923555 3.352169 0.51322
C  -4.357231 -0.11707 0.84641
C  3.548537 -2.834478 1.097832
H  -0.137264 -2.490388 -0.283123
H  0.851381 -0.585314 -2.568249
H  -0.811845 -1.402351 -2.491691
H  0.469535 0.549894 1.882146
H  -2.365762 1.09943 -1.685625
H  0.768477 1.721371 -2.28707
H  -1.323147 -1.56985 1.575161
H  1.702484 2.620026 2.555067
H  -4.724028 1.20967 -0.844533
H  1.983858 3.803137 -1.617277
H  -3.67579 -1.458222 2.422797
H  2.459089 4.261928 0.807187
H  -5.387528 -0.068652 1.216338
H  4.136887 -3.215532 0.24597
H  3.521209 -3.56466 1.918896
H  3.978284 -1.874605 1.430426
