program: Gaussian 09
title: 000275636
version: EM64L-G09RevD.01
frameworkgroup: C1[X(C15H17NO4)]
method: RPBEPBE
basis: SDD
operation: Freq
keyword: #p
keyword: freq=noraman
keyword: PBEPBE/SDD
title: #p freq=noraman PBEPBE/SDD
converged: YES YES NO NO
title: Mulliken charges:
elementType: O O O O N C C C C C C C C C C C C C C C H H H H H H H H H H H H H H H H H
charge: -0.315720 -0.246733 -0.201295 -0.202495 0.027357 -0.394658 -0.450606 -0.373032 -0.033673 -0.392118 -0.478236 -0.217576 -0.147161 0.197100 0.230083 -0.317296 -0.311441 -0.352089 -0.345460 0.387841 0.215954 0.206649 0.214826 0.219050 0.199760 0.193312 0.247741 0.205550 0.206429 0.206339 0.217220 0.243933 0.217167 0.282265 0.281250 0.290807 0.288955
chargesum: 0.00000
title: Mulliken charges with hydrogens summed into heavy atoms:
elementType: O O O O N C C C C C C C C C C C C C C C
charge: -0.315720 -0.246733 -0.201295 -0.202495 0.027357 0.027945 -0.016730 0.020040 0.214068 0.019861 -0.054677 0.026357 0.070006 0.197100 0.230083 -0.035031 -0.030191 -0.061281 -0.056504 0.387841
polarizability: 2.86247728e+02 -1.02471234e+01 1.67753435e+02 2.25771432e-01 1.38135466e+01 1.18613706e+02
1716.lowfreq: -4.9915 -1.9159 -0.0008 -0.0007 0.0003 2.6717 7.7794 25.7786 39.8272
frequency: 7.1389 25.7192 39.8155 46.6815 70.1787 88.2783 90.4071 154.2362 162.6715 193.2673 230.8922 238.6059 255.7227 275.6591 284.3981 324.9034 351.9912 375.0012 410.2778 423.0483 428.8939 460.3897 487.3935 497.2982 520.5848 546.3014 610.7075 624.0893 650.9412 679.6523 684.1054 708.3122 754.1553 764.0892 771.8904 775.1817 812.5940 848.2877 863.3500 864.0081 880.4105 888.9910 905.4468 968.0702 975.1541 995.1138 1001.9137 1004.4602 1006.2337 1011.8055 1042.8250 1062.7426 1089.4834 1100.2148 1108.3194 1111.1628 1134.2263 1137.6694 1175.1053 1208.8106 1214.3064 1218.6114 1233.5020 1244.0195 1252.5948 1261.3354 1291.5105 1300.9823 1314.0894 1325.9775 1329.0549 1339.4834 1346.8388 1358.5099 1367.1248 1394.4416 1405.3315 1414.1538 1457.6107 1465.0174 1468.9609 1472.9555 1474.3298 1481.6453 1589.1727 1609.1242 1619.1655 1667.1373 2964.2039 2969.7894 2974.6623 2980.4877 2990.0879 3019.9815 3028.1391 3028.9789 3037.8374 3041.1953 3055.7386 3095.1848 3128.6694 3164.9816 3175.9457 3187.8575 3193.6454
redmass: 4.4082 6.3736 4.9759 9.4774 5.7268 6.5717 7.0355 2.9323 2.3929 5.2804 3.0274 5.5280 5.0376 3.3227 4.5252 2.4693 3.7133 4.4853 2.8885 2.3851 2.4590 4.0662 9.0701 3.1014 4.3076 2.6261 3.9634 6.9959 6.2287 7.6793 3.9032 1.9645 1.7398 4.9119 5.4310 1.6454 7.7203 2.3096 1.9064 1.2514 2.4915 1.6711 3.7976 1.5339 1.5391 1.8310 2.5848 1.3442 2.9483 1.3669 2.6192 5.0272 3.2671 2.2481 1.3330 1.8590 1.7535 1.8476 1.2264 1.1990 6.0117 1.2645 1.2269 3.7924 1.2188 1.1757 1.2580 1.2100 1.2889 1.3082 1.3645 1.3732 1.3619 1.3518 7.8472 1.5641 8.1407 4.5663 1.0844 1.0833 1.0920 1.0935 2.4219 1.0919 9.1533 6.4697 10.3235 6.9765 1.0603 1.0631 1.0637 1.0599 1.0636 1.0976 1.0994 1.0912 1.1002 1.0957 1.1007 1.0849 1.0982 1.0901 1.0890 1.0959 1.0973
irintensity: 0.0393 0.0389 0.0105 0.2007 0.0038 3.3509 2.7844 0.3275 0.2442 3.4834 4.6562 4.1104 1.3259 1.6800 5.1523 2.2753 1.8544 2.8590 0.0004 1.2920 6.0096 0.8837 8.0105 3.1945 0.3218 0.6224 3.8099 0.3760 0.0284 5.1297 51.7279 15.1590 77.9784 5.7845 19.6112 9.1691 10.5120 11.2428 9.6082 0.8075 37.3890 54.3202 76.7515 6.9532 3.3883 4.9777 96.0471 0.6442 4.7277 0.0192 1.5125 319.8398 11.6420 5.0074 13.4112 0.9630 4.2431 4.2605 2.3044 29.6788 517.6338 0.5989 0.6756 176.2236 1.7534 6.3274 0.5081 32.8163 2.0084 0.6051 0.4672 0.0118 0.1285 0.9297 85.5611 3.0096 10.6387 62.2524 3.6604 13.0745 6.3930 8.3071 3.1477 18.7464 51.6173 6.2998 97.2923 8.1184 31.5993 34.3872 23.6367 14.8891 35.8382 54.8832 63.9084 13.2689 58.0577 18.1434 49.1480 11.6066 27.7545 1.3602 1.0409 0.3628 0.4843
temp: 298.150 k
press: 1.00000 atm
elementType: 8 8 8 8 7 6 6 6 6 6 6 6 6 6 6 6 6 6 6 6 1 1 1 1 1 1 1 1 1 1 1 1 1 1 1 1 1
symmnumber: 1
zpe: 772570.2 jmol-1
zpe.correction: 0.294256 hartree
zpe.thermalcorrener: 0.312506 hartree
zpe.thermalcorrenthalpy: 0.313450 hartree
zpe.thermalcorrgfe: 0.244553 hartree
zpe.sumelectzpe: -935.869804 hartree
zpe.sumelectthermal: -935.851555 hartree
zpe.sumelectthermalent: -935.850610 hartree
zpe.sumelectthermalfe: -935.919508 hartree
dipole: 6.2908 1.0660 0.0985
dipole: 6.3812
quadrupole: -142.5859 -117.3503 -115.2834
quadrupole: 5.5473 2.4919 -0.3060
quadrupole: -17.5127 7.7229 9.7898 5.5473 2.4919 -0.3060
hfenergy: -936.1640604 hartree
pointgroup: C01 [X(C15H17N1O4)]
dipole: 2.4739697 0.406938 0.1294828 debye
polarizability: 286.2909637|-8.8520414|156.3592128|-4.3941287|24.9304075|129.9646928 unknown
InChI: InChI=1S/C15H17NO4/c17-15(12-8-10-13(11-9-12)16(18)19)20-14-6-4-2-1-3-5-7-14/h4,6,8-11,14H,1-3,5,7H2
charge 0 multiplicity 1
37 atoms
O  0.865282 0.45443 0.133977
O  0.579342 -1.46803 -1.170621
O  -6.374121 -0.629181 -0.350503
O  -5.991586 1.212439 0.939654
N  -5.587342 0.218683 0.221929
C  4.438902 1.836833 -0.315289
C  2.891871 1.723376 -0.35535
C  5.225799 0.74716 -1.107294
C  2.366864 0.327688 0.044728
C  5.836111 -0.40767 -0.26434
C  4.833634 -1.443469 0.334796
C  2.881806 -0.159014 1.375808
C  3.996994 -0.927018 1.494888
C  0.100935 -0.520949 -0.498846
C  -1.366575 -0.295785 -0.29024
C  -2.269988 -1.205414 -0.898719
C  -1.857557 0.784567 0.487898
C  -3.657569 -1.043613 -0.736039
C  -3.243655 0.95819 0.659727
C  -4.121309 0.039323 0.043273
H  4.777858 1.831461 0.738028
H  4.695347 2.835969 -0.717698
H  2.45446 2.478908 0.326098
H  2.52156 1.94929 -1.374357
H  6.068861 1.238462 -1.631882
H  4.585666 0.322025 -1.908237
H  2.581162 -0.407241 -0.751402
H  6.44241 0.028022 0.555363
H  6.541509 -0.967082 -0.911878
H  5.413684 -2.32038 0.679252
H  4.176459 -1.805622 -0.481314
H  2.346842 0.200058 2.264995
H  4.34667 -1.180568 2.505721
H  -1.862471 -2.029663 -1.492033
H  -1.147408 1.475425 0.948458
H  -4.378089 -1.727144 -1.1919
H  -3.654259 1.779236 1.252645
