program: Gaussian 09
title: 000275631
version: EM64L-G09RevD.01
frameworkgroup: C1[X(C14H20O)]
method: RPBEPBE
basis: SDD
operation: Freq
keyword: #pfreq=noraman
keyword: PBEPBE/SDD
title: #p freq=noraman PBEPBE/SDD
converged: YES YES NO NO
title: Mulliken charges:
elementType: O C C C C C C C C C C C C C C H H H H H H H H H H H H H H H H H H H H
charge: -0.486022 0.219514 -0.183739 -0.219823 0.217366 0.342632 -0.772974 -0.749943 -0.754101 -0.748140 -0.412538 -0.375131 -0.247942 -0.262207 -0.241718 0.221380 0.274251 0.269037 0.197595 0.209569 0.205549 0.217978 0.225346 0.197933 0.241249 0.250221 0.232439 0.199090 0.242741 0.335758 0.245980 0.231445 0.224408 0.225500 0.227298
chargesum: 0.00000
title: Mulliken charges with hydrogens summed into heavy atoms:
elementType: O C C C C C C C C C C C C C C
charge: -0.150265 0.219514 0.037641 0.054429 0.217366 0.342632 -0.096774 -0.101069 -0.064699 -0.073870 -0.166558 -0.143686 -0.023534 -0.036707 -0.014420
polarizability: 1.77863659e+02 -5.96483035e+00 1.23381349e+02 -1.77864811e+00 -3.43965212e+00 1.44576551e+02
1716.lowfreq: -8.9642 -3.1450 -0.0005 0.0001 0.0002 14.2967 59.2332 75.5362 91.4479
frequency: 59.2201 75.5033 91.4302 117.6627 159.1925 194.3585 196.1575 201.8058 218.1659 225.9489 246.6895 266.2808 278.9675 285.8412 293.2695 316.9858 327.1849 353.0537 412.0502 412.9329 424.8601 483.8068 530.9596 540.4334 586.2651 616.8963 659.6081 713.3947 757.5231 792.7736 801.8931 816.7326 860.2199 881.4564 908.2236 910.3835 924.1743 961.5802 981.7881 991.3106 993.1852 996.2547 1000.7885 1026.6691 1040.8124 1067.6292 1081.9050 1102.4579 1103.2286 1105.7787 1151.6176 1166.2826 1170.8254 1171.5058 1186.9394 1198.2756 1219.3278 1283.3216 1310.6520 1323.3062 1338.7171 1370.2935 1374.0096 1385.9551 1390.4173 1392.9271 1425.6568 1433.1282 1454.6155 1466.1156 1470.4983 1471.4849 1474.7361 1478.7876 1484.0207 1485.0185 1491.1757 1583.3598 1610.5672 2966.0808 2967.4901 2972.7663 2977.3055 3040.7371 3048.4332 3062.2645 3063.0788 3069.7149 3071.5202 3098.2409 3101.9001 3111.2721 3118.3852 3124.0636 3127.0409 3137.8387 3146.1346 3161.4157 3555.7704
redmass: 3.4092 3.6882 3.8782 3.2014 2.8019 1.3056 1.1183 2.2510 1.4302 1.3671 1.1259 3.0679 1.4996 2.9992 2.1589 2.2748 2.8976 3.3949 2.7703 2.9045 3.3669 3.0931 3.3110 3.2287 2.8857 6.3031 5.1992 1.7166 2.2378 2.6095 2.4947 3.9376 1.2463 2.0877 1.5323 2.5798 1.4018 1.3061 1.3715 2.1470 2.2056 1.3370 1.4524 2.1181 1.6222 1.6041 1.5336 1.9132 1.9907 1.8570 2.0270 2.2648 1.0538 1.8824 1.1265 3.1856 1.8693 2.0306 1.4029 1.6970 1.5079 6.1980 1.2296 1.2179 1.2280 1.2115 2.5160 2.2864 1.0500 1.0540 1.0506 1.0623 1.0706 1.1307 1.0633 2.0570 1.0559 5.9888 6.1018 1.0375 1.0376 1.0389 1.0383 1.0979 1.0984 1.0873 1.0952 1.0954 1.0978 1.1001 1.0997 1.0962 1.0843 1.0873 1.0878 1.0921 1.0959 1.1014 1.0659
irintensity: 0.8677 0.0542 0.3116 0.7881 0.2527 4.2159 3.5175 0.7730 29.6921 2.8181 75.2957 1.8848 1.4970 1.1521 5.5186 1.2337 2.8940 2.0332 0.7427 1.1182 4.6410 4.9277 6.6037 11.9668 10.2492 0.0894 5.5508 57.0231 32.9077 23.8126 7.7977 1.0834 0.2146 4.6379 0.2091 7.7276 2.7211 22.7107 0.2222 3.2157 5.9019 2.5548 12.6517 7.1684 14.1564 26.9125 28.4468 10.7138 45.6618 3.2437 1.6191 11.4736 0.0162 6.2462 0.4156 15.7930 10.1826 0.4993 1.6338 28.4114 3.7907 0.9606 26.2841 15.8715 16.5739 10.8999 2.4570 7.8929 1.5793 1.0058 8.4582 14.6560 7.7249 12.0778 14.9050 16.2757 14.2601 1.5834 8.9001 79.5579 35.4630 15.0416 42.7380 40.7322 40.0299 14.9241 6.0903 67.0271 29.9245 12.0945 27.3199 7.9492 3.4220 0.3288 13.8535 23.6804 43.7927 19.1072 3.7932
temp: 298.150 k
press: 1.00000 atm
elementType: 8 6 6 6 6 6 6 6 6 6 6 6 6 6 6 1 1 1 1 1 1 1 1 1 1 1 1 1 1 1 1 1 1 1 1
symmnumber: 1
zpe: 790017.9 jmol-1
zpe.correction: 0.300902 hartree
zpe.thermalcorrener: 0.316948 hartree
zpe.thermalcorrenthalpy: 0.317892 hartree
zpe.thermalcorrgfe: 0.259456 hartree
zpe.sumelectzpe: -619.530706 hartree
zpe.sumelectthermal: -619.514660 hartree
zpe.sumelectthermalent: -619.513716 hartree
zpe.sumelectthermalfe: -619.572151 hartree
dipole: 0.3776 -1.5990 -0.2715
dipole: 1.6653
quadrupole: -88.9230 -90.7467 -87.5329
quadrupole: 4.0921 1.0004 0.7034
quadrupole: 0.1445 -1.6792 1.5347 4.0921 1.0004 0.7034
hfenergy: -619.8316075 hartree
pointgroup: C01 [X(C14H20O1)]
dipole: 0.1629733 -0.5748734 -0.2686969 debye
polarizability: 178.0594774|-3.8134436|126.2616308|-3.4719085|-8.3432045|141.5004512 unknown
InChI: InChI=1S/C14H20O/c1-10-11(2)14(10,13(3,4)15)12-8-6-5-7-9-12/h5-11,15H,1-4H3
charge 0 multiplicity 1
35 atoms
O  -2.855928 -0.768134 -0.818496
C  -0.734822 0.153267 -0.007923
C  -1.404558 0.921986 1.165476
C  -1.395622 1.537183 -0.245482
C  -1.410122 -1.10376 -0.641868
C  0.779454 0.057619 0.049935
C  -2.683488 0.532815 1.896619
C  -0.612872 2.809626 -0.538924
C  -1.29592 -2.33288 0.289781
C  -0.842901 -1.426768 -2.044692
C  1.427422 -0.42897 1.216304
C  1.591648 0.434557 -1.053539
C  2.833796 -0.548944 1.277823
C  2.998128 0.321648 -0.997235
C  3.626821 -0.175263 0.168261
H  -0.654882 1.378761 1.829761
H  -2.354542 1.455089 -0.7704
H  -3.410536 0.075265 1.208366
H  -2.480357 -0.183573 2.716994
H  -3.143788 1.431193 2.351664
H  -0.404539 2.925867 -1.620142
H  -1.192616 3.695166 -0.214947
H  0.355603 2.82768 -0.008082
H  -1.769137 -3.220105 -0.174665
H  -0.238721 -2.581401 0.488602
H  -1.79849 -2.132154 1.250685
H  -0.95756 -0.556266 -2.713919
H  -1.396118 -2.278851 -2.487439
H  0.223078 -1.705825 -2.004083
H  -3.287087 -1.537978 -1.269135
H  0.818394 -0.705099 2.085376
H  1.114995 0.829667 -1.957696
H  3.309634 -0.928386 2.189514
H  3.603122 0.624291 -1.859779
H  4.718306 -0.262621 0.213682
