program: Gaussian 09
title: 000275628
version: EM64L-G09RevD.01
frameworkgroup: C1[X(C13H15F3O)]
method: RPBEPBE
basis: SDD
operation: Freq
keyword: #p
keyword: freq=noraman
keyword: PBEPBE/SDD
title: #p freq=noraman PBEPBE/SDD
converged: YES YES NO NO
title: Mulliken charges:
elementType: F F F O C C C C C C C C C C C C C H H H H H H H H H H H H H H H
charge: -0.165964 -0.166840 -0.167568 -0.444591 -0.230120 -0.093092 -0.444416 -0.427889 -0.400869 -0.394588 0.488214 -0.446936 -0.370458 -0.342891 -0.362363 0.284396 0.257375 0.218980 0.185448 0.222500 0.193679 0.224851 0.211511 0.199122 0.206003 0.195086 0.209154 0.342440 0.254286 0.241779 0.263062 0.260700
chargesum: 0.00000
title: Mulliken charges with hydrogens summed into heavy atoms:
elementType: F F F O C C C C C C C C C C C C C
charge: -0.165964 -0.166840 -0.167568 -0.102151 -0.011140 0.092356 -0.028237 0.008472 0.004256 0.009651 0.488214 -0.192650 -0.128679 -0.079829 -0.101663 0.284396 0.257375
polarizability: 1.96042614e+02 4.64030851e+00 1.10781236e+02 1.26933277e-01 1.24758202e+01 1.18343239e+02
1716.lowfreq: -13.5934 -3.9019 -0.0010 -0.0009 -0.0003 4.1838 11.0911 28.3762 47.5058
frequency: 9.5430 28.2653 47.3556 65.8352 119.6294 129.9043 171.2476 187.4428 227.1840 249.6220 310.6698 327.3864 340.4023 354.6560 370.8360 402.1940 407.2676 412.9864 420.8894 468.3022 490.2565 517.4365 533.2846 583.7115 610.3186 631.1676 700.4777 746.8779 770.2713 811.5945 835.7065 842.2069 854.7358 873.1843 891.5946 943.7772 946.2958 967.5056 980.4791 982.6020 994.8482 1015.1031 1021.4915 1030.5294 1037.0525 1054.0986 1095.3716 1106.3099 1109.0530 1137.6523 1191.5944 1195.3286 1211.3068 1225.1162 1230.5006 1259.0257 1284.1083 1284.2357 1286.7440 1312.1089 1318.8663 1326.5417 1337.0295 1341.5928 1349.2675 1380.6450 1389.3217 1412.5219 1461.6352 1462.7425 1469.5335 1475.7781 1504.9526 1582.0135 1621.3240 2917.2286 2971.1493 2972.2453 2974.4774 2984.4995 2992.1148 3036.2030 3038.1676 3046.9643 3060.8715 3137.4112 3138.8330 3164.0648 3168.0251 3538.2510
redmass: 8.7823 4.5860 5.4365 3.7398 7.1669 4.5046 3.2381 5.8688 3.9203 4.8605 1.6669 2.1832 1.6873 6.7300 6.0683 2.9319 3.3548 3.8796 3.9433 3.7090 4.9554 9.9667 2.3284 3.1016 7.5779 7.0901 5.6620 4.0229 2.0439 2.7650 1.8842 1.6317 1.2575 1.7223 1.8975 2.3214 2.4316 1.6562 2.9447 1.7462 6.8888 3.4628 7.1989 2.6921 1.7590 1.6247 1.3488 2.3072 2.0576 1.5219 1.4724 1.1816 1.7830 1.2917 1.5110 1.3072 2.7772 1.4551 1.5338 1.2695 1.2809 1.3592 1.4217 1.4136 1.5098 1.7612 4.1290 2.6288 1.0894 1.0891 1.0818 1.0949 2.6416 6.9128 6.2972 1.0827 1.0653 1.0662 1.0613 1.0783 1.0640 1.0961 1.0981 1.1019 1.1021 1.0888 1.0888 1.0954 1.0966 1.0657
irintensity: 0.0960 0.4240 1.0673 0.5074 0.2365 1.3341 0.9230 0.5136 0.2858 0.6374 5.0994 48.9333 95.9774 5.4008 3.9841 0.7504 1.3442 4.5757 2.1975 1.7602 2.1868 0.3956 9.5395 24.8205 9.7841 0.9792 0.7113 1.9397 6.7753 7.9129 61.9977 13.5666 2.4106 0.5199 10.7502 28.0024 8.1894 48.7595 128.7307 44.3219 128.8070 84.2163 155.7100 52.6264 0.7370 1.7748 19.5838 16.1730 3.1535 2.8098 1.6918 14.6106 0.0292 19.5942 7.1130 9.7467 265.9669 54.2015 46.9962 1.9701 0.3213 19.3598 0.7683 0.2532 4.9156 8.7705 2.2499 17.2641 10.2746 7.5543 17.5095 4.7188 0.3659 2.6395 49.5308 32.0381 20.9892 26.7522 33.3332 21.1629 36.5115 53.0546 49.6927 51.0028 54.8630 5.8404 9.2733 6.7292 0.1453 1.3900
temp: 298.150 k
press: 1.00000 atm
elementType: 9 9 9 8 6 6 6 6 6 6 6 6 6 6 6 6 6 1 1 1 1 1 1 1 1 1 1 1 1 1 1 1
symmnumber: 1
zpe: 665249.0 jmol-1
zpe.correction: 0.253380 hartree
zpe.thermalcorrener: 0.269085 hartree
zpe.thermalcorrenthalpy: 0.270029 hartree
zpe.thermalcorrgfe: 0.207929 hartree
zpe.sumelectzpe: -877.867895 hartree
zpe.sumelectthermal: -877.852190 hartree
zpe.sumelectthermalent: -877.851246 hartree
zpe.sumelectthermalfe: -877.913347 hartree
dipole: -3.7905 -1.8535 0.3021
dipole: 4.2302
quadrupole: -114.7020 -106.0555 -94.7293
quadrupole: 7.3777 1.1208 4.1439
quadrupole: -9.5397 -0.8932 10.4330 7.3777 1.1208 4.1439
hfenergy: -878.1212753 hartree
pointgroup: C01 [X(C13H15F3O1)]
dipole: 1.4791053 -0.7623536 -0.0298677 debye
polarizability: 195.8710977|-6.0223428|108.0492944|0.4740554|-11.1985527|121.2466967 unknown
InChI: InChI=1S/C13H15F3O/c14-13(15,16)10-7-5-9(6-8-10)11-3-1-2-4-12(11)17/h5-8,11-12,17H,1-4H2
charge 0 multiplicity 1
32 atoms
F  -4.552128 -0.066974 -1.091205
F  -4.369347 -0.978358 0.983573
F  -4.273698 1.267468 0.716306
O  2.187016 2.285834 0.07917
C  1.983808 -0.154623 -0.465019
C  2.655295 0.93633 0.428708
C  2.607417 -1.545948 -0.156925
C  4.180271 0.951428 0.246577
C  4.141818 -1.529754 -0.344185
C  4.800473 -0.436172 0.52949
C  0.46656 -0.137275 -0.312396
C  -0.357415 0.352919 -1.359415
C  -0.162449 -0.57867 0.88445
C  -1.760832 0.396169 -1.228943
C  -1.562319 -0.538175 1.028352
C  -2.364211 -0.052751 -0.032126
C  -3.852118 0.032487 0.135644
H  2.230251 0.109952 -1.514094
H  2.411505 0.70925 1.493023
H  2.141251 -2.308096 -0.8097
H  2.375222 -1.83821 0.887646
H  4.609831 1.722917 0.911538
H  4.398866 1.262494 -0.794085
H  4.380025 -1.338868 -1.410571
H  4.559219 -2.523897 -0.094378
H  4.66762 -0.693683 1.600656
H  5.890763 -0.401986 0.345132
H  1.200539 2.320917 0.178514
H  0.108765 0.696957 -2.289378
H  0.443778 -0.964288 1.711254
H  -2.382277 0.765916 -2.050387
H  -2.033799 -0.890211 1.951275
