program: Gaussian 09
title: 000277484
version: EM64L-G09RevD.01
frameworkgroup: C1[X(C15H10N2O2)]
method: RPBEPBE
basis: SDD
operation: Freq
keyword: #p
keyword: freq=noraman
keyword: PBEPBE/SDD
title: #p freq=noraman PBEPBE/SDD
converged: YES YES NO NO
title: Mulliken charges:
elementType: O O N N C C C C C C C C C C C C C C C H H H H H H H H H H
charge: -0.188258 -0.196304 0.007334 -0.022361 0.228657 0.221431 0.217279 0.446038 -0.316626 -0.343616 -0.338585 -0.228699 -0.222261 -0.393702 -0.331857 -0.242275 -0.249158 -0.229263 -0.292607 0.251807 0.260602 0.274382 0.243230 0.246401 0.236425 0.256255 0.234367 0.235398 0.235967
chargesum: 0.00000
title: Mulliken charges with hydrogens summed into heavy atoms:
elementType: O O N N C C C C C C C C C C C C C C C
charge: -0.188258 -0.196304 0.007334 -0.022361 0.228657 0.221431 0.217279 0.446038 -0.064820 -0.083013 -0.064203 0.014530 0.024140 -0.157277 -0.075602 -0.007909 -0.013761 0.006704 -0.292607
polarizability: 3.14092886e+02 -1.94648411e+01 1.79321323e+02 4.85319317e-01 1.23341977e+01 1.12167712e+02
1716.lowfreq: -6.0046 -1.1188 -0.0011 -0.0005 0.0004 3.7156 25.6104 32.0899 47.1023
frequency: 25.1914 32.0470 47.1011 56.3912 68.9306 122.9986 138.9105 152.3027 181.6452 218.9838 243.8559 310.0724 333.3378 349.4712 380.1114 402.0299 411.2031 458.0226 486.0188 522.0678 555.7562 582.0085 612.8129 638.1686 654.9756 668.2532 688.7851 692.1186 743.7069 766.7003 774.1830 781.6463 787.4932 827.2242 848.4610 883.3584 914.7479 948.6621 964.8301 982.5713 985.1071 992.1446 998.0724 1004.6287 1029.1555 1041.9507 1079.4373 1094.7403 1140.1822 1176.6598 1180.8797 1201.8764 1215.9602 1221.2706 1249.4144 1276.1156 1325.7825 1363.4591 1366.5262 1376.1528 1399.1417 1425.8168 1442.0986 1470.3754 1485.8859 1569.0053 1576.7998 1596.8781 1604.7657 1610.7357 2145.8048 3126.2682 3136.1877 3142.7587 3150.6446 3155.5344 3157.5893 3166.7208 3168.9996 3183.6300 3189.4154
redmass: 4.6159 6.8393 9.4001 7.1937 5.4433 5.5344 8.9190 6.2464 6.0308 8.5738 5.7243 6.7229 3.8606 6.4566 6.0901 2.7881 5.4664 7.2865 4.5537 3.4780 5.3470 5.3762 6.4372 6.8016 5.5772 6.6817 7.2792 1.7033 3.4039 6.6033 1.7827 1.5639 6.2275 5.4568 1.2638 1.4335 1.3252 1.5326 1.4064 5.2841 1.4170 5.8127 1.3614 1.3413 2.2097 3.1374 2.7229 1.6666 1.8618 1.0712 1.0721 1.1301 2.3896 11.0864 2.8495 1.6446 1.5856 1.9736 10.2488 4.8949 2.9931 2.3689 2.2074 2.4300 2.2192 6.4183 5.8292 6.0867 6.2856 5.9986 12.6312 1.0873 1.0882 1.0869 1.0935 1.0909 1.0888 1.0994 1.0952 1.0996 1.0946
irintensity: 1.4154 3.1529 1.5943 0.5077 1.0781 0.1682 3.9046 2.4782 0.0430 0.9031 0.3557 1.0547 0.2585 1.0699 3.3720 0.0901 0.7716 0.8497 5.0163 13.1850 4.3902 13.9561 0.0396 4.3326 6.1016 11.7928 12.0537 59.5633 13.3017 3.1055 48.9454 60.3067 6.5169 0.2105 0.3975 0.7835 8.7710 19.9272 2.3483 4.4480 0.8488 1.2241 0.1810 0.1526 5.0704 1.9311 6.1614 9.0314 2.8588 0.7517 1.0516 13.0446 15.8018 184.1556 8.9520 6.3029 2.0327 0.6976 148.6015 10.7213 14.3805 4.8176 17.2064 45.2752 15.6546 20.6871 20.6717 115.4735 1.9974 2.5593 31.5890 3.4792 0.7931 1.9761 21.4688 7.2815 5.0565 30.5926 7.6674 9.4644 7.9008
temp: 298.150 k
press: 1.00000 atm
elementType: 8 8 7 7 6 6 6 6 6 6 6 6 6 6 6 6 6 6 6 1 1 1 1 1 1 1 1 1 1
symmnumber: 1
zpe: 553163.6 jmol-1
zpe.correction: 0.210689 hartree
zpe.thermalcorrener: 0.226568 hartree
zpe.thermalcorrenthalpy: 0.227512 hartree
zpe.thermalcorrgfe: 0.165017 hartree
zpe.sumelectzpe: -836.133179 hartree
zpe.sumelectthermal: -836.117300 hartree
zpe.sumelectthermalent: -836.116356 hartree
zpe.sumelectthermalfe: -836.178851 hartree
dipole: -0.2949 0.6374 -4.3496
dipole: 4.4059
quadrupole: -77.2462 -119.7707 -115.0377
quadrupole: -8.8809 7.0510 0.3638
quadrupole: 26.7720 -15.7525 -11.0195 -8.8809 7.0510 0.3638
hfenergy: -836.3438678 hartree
pointgroup: C01 [X(C15H10N2O2)]
dipole: 0.0401764 1.6466841 0.5399519 debye
polarizability: 314.4875213|16.2607718|116.4363162|-10.5749525|-19.1940356|174.6580833 unknown
InChI: InChI=1S/C15H10N2O2/c16-11-13(10-12-6-2-1-3-7-12)14-8-4-5-9-15(14)17(18)19/h1-10H
charge 0 multiplicity 1
29 atoms
O  2.672404 -2.363442 1.789083
O  0.747038 -1.22222 2.213662
N  1.906519 -1.332295 1.655854
N  -0.162151 -0.155789 -3.021757
C  1.622957 0.512448 -0.098109
C  2.424037 -0.204975 0.841415
C  0.180531 0.249188 -0.438583
C  -2.29734 0.162058 0.331369
C  -0.847233 0.31998 0.483777
C  2.297164 1.511058 -0.857792
C  3.800994 0.067843 1.023072
C  3.658327 1.814715 -0.664527
C  4.417984 1.09334 0.286454
C  -3.076551 0.302406 1.521126
C  -2.97985 -0.121268 -0.890673
C  -4.477846 0.169085 1.497575
C  -4.381816 -0.252852 -0.910799
C  -5.137942 -0.108691 0.277568
C  -0.035867 0.025781 -1.843553
H  -0.529847 0.541916 1.507772
H  1.724871 2.056961 -1.615219
H  4.366239 -0.539295 1.735543
H  4.12584 2.605736 -1.259569
H  5.478011 1.316719 0.440502
H  -2.56574 0.50838 2.469564
H  -2.424283 -0.239227 -1.823597
H  -5.053541 0.277409 2.42284
H  -4.888598 -0.470479 -1.857074
H  -6.22811 -0.214191 0.25238
